program: Gaussian 09
title: 000143350
version: EM64L-G09RevD.01
frameworkgroup: C1[X(C16H13NO2)]
method: RPBEPBE
basis: SDD
operation: Freq
keyword: #p
keyword: freq=noraman
keyword: PBEPBE/SDD
title: #p freq=noraman PBEPBE/SDD
converged: NO YES NO NO
title: Mulliken charges:
elementType: O O N C C C C C C C C C C C C C C C C H H H H H H H H H H H H H
charge: -0.294175 -0.258573 -0.137479 0.380412 0.154641 -0.414155 0.420911 -0.388731 0.073440 -0.388042 -0.362248 -0.355291 -0.333755 -0.234781 -0.235377 -0.345352 -0.344162 0.330016 -0.537207 0.274654 0.279879 0.226138 0.282232 0.261399 0.271891 0.228143 0.231061 0.249694 0.261801 0.252481 0.226195 0.224340
chargesum: 0.00000
title: Mulliken charges with hydrogens summed into heavy atoms:
elementType: O O N C C C C C C C C C C C C C C C C
charge: -0.294175 -0.258573 -0.137479 0.380412 0.154641 -0.139501 0.420911 -0.108852 0.073440 -0.161904 -0.080016 -0.093893 -0.061864 -0.006638 -0.004316 -0.095658 -0.082361 0.330016 0.165808
polarizability: 3.31257142e+02 -1.01736905e+01 1.93045807e+02 2.59811960e-01 1.66520679e+00 9.75010451e+01
1716.lowfreq: -7.9789 -3.7451 -0.0008 -0.0007 -0.0005 1.1975 37.4374 42.3762 59.1437
frequency: 37.3883 42.3697 59.1388 105.6678 117.0262 166.6883 186.3990 200.0226 225.4987 241.4464 259.9875 278.9691 348.6756 367.6335 417.2269 429.4311 446.7366 475.1674 495.1389 519.2350 528.5819 558.8484 591.1761 610.2155 618.7713 635.4841 657.6132 718.0264 728.3532 729.9624 768.3077 769.7022 791.8447 809.0831 812.7212 837.3443 850.2636 886.1302 924.5520 941.1586 964.9420 975.5405 982.7296 1000.1449 1005.9402 1017.1853 1064.2005 1098.1323 1111.8852 1113.4053 1136.7454 1155.7851 1169.3173 1176.5053 1208.6011 1235.3535 1253.4948 1257.4003 1296.4537 1300.4412 1353.0595 1376.9398 1402.9099 1412.9165 1429.7091 1431.2169 1437.4832 1467.6400 1469.5935 1471.4435 1496.9565 1506.7776 1544.0600 1568.1444 1589.3559 1616.8780 1623.7930 2967.2769 3058.9662 3120.9617 3133.7506 3136.2630 3149.4631 3151.2230 3154.4420 3165.3379 3173.7257 3178.7615 3198.4418 3205.1972
redmass: 4.0131 5.1094 4.8664 3.8468 5.1392 4.6950 3.6904 3.7100 5.8572 1.4548 2.9984 5.7456 4.5093 6.1668 3.0185 3.4372 4.9079 5.6351 4.7439 3.4974 3.8272 6.9171 4.0550 4.8712 5.9408 3.1263 4.1994 2.6957 4.2274 1.6185 2.1975 5.1289 1.5382 2.0233 1.3283 1.8780 3.5752 1.5212 4.9984 1.3913 1.3403 1.3653 8.5175 2.7149 1.3334 2.5034 2.9760 2.6315 1.2612 1.3022 1.6912 1.3222 1.0837 1.1845 1.9295 2.7415 2.0685 1.9419 1.8354 1.5574 2.2921 5.2085 10.6104 4.5781 2.4250 2.6802 1.3085 2.6082 1.0565 1.1447 2.5028 7.0185 4.4775 7.2947 7.6586 6.4094 6.5113 1.0327 1.1045 1.0864 1.0998 1.0893 1.0891 1.0942 1.0895 1.1000 1.0950 1.0969 1.0912 1.0942
irintensity: 0.8572 0.1299 0.0667 2.3458 5.8918 2.0115 1.3491 4.0397 0.5260 0.8386 1.5787 4.7473 1.3342 0.2743 0.3309 4.6235 3.1418 0.9257 2.7369 5.4364 19.9593 21.3425 7.2885 3.3698 4.1114 4.4172 1.3321 3.0495 2.9832 1.7487 6.5460 4.0321 89.0631 76.2584 8.2263 33.7571 15.6262 0.4199 5.1948 1.1851 0.3513 2.4357 47.6238 7.5063 1.3494 17.9383 17.5519 27.1791 1.2774 15.1286 16.5263 4.3672 0.0651 67.4400 88.1103 141.2343 16.8615 11.1609 2.5158 1.4827 3.1971 24.1266 4.5624 24.9277 2.4973 20.3729 33.8767 6.8462 17.0520 71.6888 179.6495 159.8193 57.8400 159.2410 16.5225 15.8315 37.3665 64.7181 42.7355 2.4498 23.0603 14.5824 7.9503 12.8982 4.0801 37.1112 6.5719 1.5529 2.4971 0.1146
temp: 298.150 k
press: 1.00000 atm
elementType: 8 8 7 6 6 6 6 6 6 6 6 6 6 6 6 6 6 6 6 1 1 1 1 1 1 1 1 1 1 1 1 1
symmnumber: 1
zpe: 650199.6 jmol-1
zpe.correction: 0.247648 hartree
zpe.thermalcorrener: 0.263076 hartree
zpe.thermalcorrenthalpy: 0.264020 hartree
zpe.thermalcorrgfe: 0.204299 hartree
zpe.sumelectzpe: -821.361840 hartree
zpe.sumelectthermal: -821.346412 hartree
zpe.sumelectthermalent: -821.345468 hartree
zpe.sumelectthermalfe: -821.405188 hartree
dipole: -6.1903 -6.2629 0.0306
dipole: 8.8060
quadrupole: -90.9284 -115.1265 -112.3637
quadrupole: -7.9350 8.8305 6.0818
quadrupole: 15.2111 -8.9870 -6.2242 -7.9350 8.8305 6.0818
hfenergy: -821.6094877 hartree
pointgroup: C01 [X(C16H13N1O2)]
dipole: 2.3812604 -2.5073798 -0.2136991 debye
polarizability: 331.6343482|7.1470882|192.3451991|0.3847205|5.7889404|97.824447 unknown
InChI: InChI=1S/C16H13NO2/c1-19-14-8-6-13(7-9-14)17-10-12-4-2-3-5-15(12)16(18)11-17/h2-11H,1H3
charge 0 multiplicity 1
32 atoms
O  -2.625226 2.762216 0.774101
O  5.537959 -0.06688 -0.29372
N  -0.119236 0.212364 0.027713
C  -2.290154 -0.830702 -0.185338
C  -2.925811 0.414593 0.165142
C  -0.868306 -0.904043 -0.255294
C  1.337354 0.111552 -0.04109
C  -0.678952 1.427104 0.37284
C  -2.109873 1.624908 0.455824
C  -3.109099 -1.97428 -0.471644
C  -4.342591 0.484364 0.231219
C  2.003755 -0.916358 0.656036
C  2.071172 1.054852 -0.800388
C  -4.502797 -1.879691 -0.402493
C  -5.12704 -0.644917 -0.047393
C  3.410538 -1.017085 0.596278
C  3.470445 0.962818 -0.861056
C  4.146645 -0.072986 -0.163949
C  6.296982 -1.106066 0.412787
H  -0.329758 -1.794534 -0.578677
H  0.005192 2.235038 0.634853
H  -2.629826 -2.922475 -0.743743
H  -4.785066 1.448628 0.503208
H  1.429288 -1.621628 1.265456
H  1.543712 1.84146 -1.349027
H  -5.121796 -2.756928 -0.621434
H  -6.219643 -0.585174 0.003319
H  3.91246 -1.813833 1.151626
H  4.061341 1.673491 -1.445517
H  7.349433 -0.907539 0.165247
H  6.150348 -1.033042 1.507358
H  6.014948 -2.117027 0.061458
