program: Gaussian 09
title: 000143348
version: EM64L-G09RevD.01
frameworkgroup: C1[X(C15H11NO)]
method: RPBEPBE
basis: SDD
operation: Freq
keyword: #p
keyword: freq=noraman
keyword: PBEPBE/SDD
title: #p freq=noraman PBEPBE/SDD
converged: YES YES NO NO
title: Mulliken charges:
elementType: O N C C C C C C C C C C C C C C C H H H H H H H H H H H
charge: -0.292743 -0.140854 0.381081 0.156983 -0.412734 0.429766 -0.387572 0.074515 -0.386476 -0.361777 -0.358054 -0.356466 -0.234059 -0.234116 -0.213661 -0.213132 -0.231494 0.276169 0.280717 0.226980 0.282596 0.265271 0.272115 0.229090 0.231809 0.237792 0.239192 0.239063
chargesum: 0.00000
title: Mulliken charges with hydrogens summed into heavy atoms:
elementType: O N C C C C C C C C C C C C C C C
charge: -0.292743 -0.140854 0.381081 0.156983 -0.136565 0.429766 -0.106855 0.074515 -0.159496 -0.079180 -0.092783 -0.084351 -0.004969 -0.002307 0.024131 0.026060 0.007568
polarizability: 2.82656492e+02 -9.93994424e+00 1.80826835e+02 -1.65298203e-01 4.98276735e+00 8.66463652e+01
1716.lowfreq: -9.8200 -5.6513 0.0002 0.0007 0.0008 3.7501 38.7191 56.5773 86.6900
frequency: 38.6167 56.5610 86.6869 121.1283 177.2437 222.9513 249.3473 266.7673 291.3574 346.5788 407.5542 427.8580 454.8056 486.9301 515.4440 524.4928 581.0401 592.6909 606.7976 626.3974 649.8828 663.1151 698.0385 727.9896 735.8422 763.7340 772.7039 793.2172 809.3462 844.5148 849.6490 886.4471 920.9283 930.3376 975.5933 977.3861 989.2356 999.8652 1005.8139 1016.3842 1024.7001 1064.3257 1083.8577 1098.1361 1136.7675 1169.6376 1176.1341 1184.6087 1209.5038 1250.3727 1256.9755 1297.0898 1315.3532 1356.3232 1385.0332 1399.9432 1411.5242 1430.2022 1447.0214 1469.0675 1478.8608 1506.4579 1543.7283 1567.6334 1601.5699 1607.0753 1618.6676 3122.0602 3136.9106 3137.8001 3145.9158 3151.8683 3155.5224 3164.4026 3165.7902 3175.9656 3199.3055 3206.0806
redmass: 4.2314 4.8285 4.9354 5.5841 4.3793 4.7321 5.9925 5.3805 6.1663 4.7087 2.8873 3.3950 4.4401 7.0743 3.9554 4.7139 7.5396 4.4055 5.4768 3.2782 3.4327 6.5625 2.0899 1.3966 3.5717 1.8368 1.8910 1.6325 1.9744 2.5552 1.6576 1.5214 2.2750 2.1977 1.3667 1.3874 5.9299 1.3198 1.3357 2.6376 2.1705 2.8654 1.5486 2.6043 1.7021 1.0853 1.0525 1.1133 2.0378 1.8144 1.8298 2.4139 1.3214 2.2148 8.1659 8.3111 3.9807 2.3570 2.3538 3.0507 2.3429 7.2191 4.4418 7.2885 6.7424 6.1287 6.4272 1.0864 1.0893 1.0855 1.0887 1.0943 1.0928 1.0972 1.1000 1.1018 1.0912 1.0942
irintensity: 1.0046 0.0675 0.6465 2.5241 0.7015 0.0595 3.1489 0.5272 2.3566 1.3465 0.0015 3.6404 1.6341 0.7877 4.9013 17.7004 3.3681 6.1082 2.8796 4.0609 0.5655 2.4964 35.0493 3.5499 2.4109 48.7332 52.4205 58.0576 60.6882 2.2435 2.2225 0.3781 3.9950 1.8709 2.4002 0.5819 2.6518 0.0524 1.1909 6.4050 14.2304 12.7838 11.5341 20.9863 17.3773 0.0329 0.0444 0.2573 38.7808 2.8266 3.8985 6.8277 0.2243 4.7298 9.4961 20.1594 26.4192 11.3207 28.9029 2.2210 63.4276 148.8373 45.0152 149.5695 2.6852 17.8439 3.4884 2.2202 14.1954 0.9190 4.0173 12.5226 18.0024 11.8045 35.3357 13.0581 2.6983 0.0564
temp: 298.150 k
press: 1.00000 atm
elementType: 8 7 6 6 6 6 6 6 6 6 6 6 6 6 6 6 6 1 1 1 1 1 1 1 1 1 1 1
symmnumber: 1
zpe: 567888.0 jmol-1
zpe.correction: 0.216297 hartree
zpe.thermalcorrener: 0.229026 hartree
zpe.thermalcorrenthalpy: 0.229970 hartree
zpe.thermalcorrgfe: 0.176367 hartree
zpe.sumelectzpe: -707.009513 hartree
zpe.sumelectthermal: -706.996784 hartree
zpe.sumelectthermalent: -706.995840 hartree
zpe.sumelectthermalfe: -707.049443 hartree
dipole: -4.7932 -5.3991 0.8161
dipole: 7.2657
quadrupole: -76.7928 -105.3034 -100.5115
quadrupole: -10.1174 0.8455 5.6274
quadrupole: 17.4098 -11.1009 -6.3089 -10.1174 0.8455 5.6274
hfenergy: -707.22581 hartree
pointgroup: C01 [X(C15H11N1O1)]
dipole: 1.8681595 -2.1122438 -0.4687753 debye
polarizability: 282.8085832|9.1260044|180.9164952|0.1153437|1.4352933|86.4046136 unknown
InChI: InChI=1S/C15H11NO/c17-15-11-16(13-7-2-1-3-8-13)10-12-6-4-5-9-14(12)15/h1-11H
charge 0 multiplicity 1
28 atoms
O  -1.76349 2.854694 0.63473
N  0.602617 0.134099 0.054686
C  -1.620478 -0.792266 -0.155626
C  -2.189125 0.502167 0.126446
C  -0.204274 -0.950271 -0.191783
C  2.053804 -0.054453 0.015727
C  0.108807 1.393802 0.333865
C  -1.309864 1.675872 0.379723
C  -2.498167 -1.89975 -0.407007
C  -3.600462 0.654785 0.160876
C  2.639354 -1.100354 0.763748
C  2.847202 0.816474 -0.763535
C  -3.885123 -1.723598 -0.369207
C  -4.443198 -0.440402 -0.082066
C  4.039533 -1.278736 0.721924
C  4.246569 0.631988 -0.794556
C  4.84516 -0.41471 -0.05523
H  0.286756 -1.886033 -0.457796
H  0.833184 2.174221 0.569404
H  -2.069432 -2.884933 -0.626838
H  -3.992471 1.653609 0.380318
H  2.010815 -1.745001 1.38681
H  2.372384 1.610882 -1.348208
H  -4.549585 -2.573582 -0.560356
H  -5.531261 -0.316601 -0.055212
H  4.499901 -2.082062 1.306432
H  4.86596 1.299668 -1.402288
H  5.930985 -0.55391 -0.082383
