program: Gaussian 09
title: 000143343
version: EM64L-G09RevD.01
frameworkgroup: C1[X(C15H28O2)]
method: RPBEPBE
basis: SDD
operation: Freq
keyword: #pfreq=noraman
keyword: PBEPBE/SDD
title: #p freq=noraman PBEPBE/SDD
converged: YES YES NO NO
title: Mulliken charges:
elementType: O O C C C C C C C C C C C C C C C H H H H H H H H H H H H H H H H H H H H H H H H H H H H
charge: -0.267078 -0.237057 -0.384897 -0.371200 -0.367282 -0.379282 -0.376461 -0.459205 -0.503664 -0.200550 -0.450248 -0.346490 -0.198406 -0.346190 0.229388 -0.694208 -0.506308 0.197408 0.195214 0.189030 0.193997 0.191164 0.189579 0.195201 0.210995 0.212577 0.220611 0.194352 0.205233 0.244739 0.247206 0.224202 0.201865 0.192080 0.188765 0.204353 0.223629 0.192423 0.195658 0.209476 0.210775 0.215147 0.232476 0.240065 0.240922
chargesum: 0.00000
title: Mulliken charges with hydrogens summed into heavy atoms:
elementType: O O C C C C C C C C C C C C C C C
charge: -0.267078 -0.237057 0.007725 0.011826 0.013461 0.026915 0.056726 -0.059620 -0.011719 0.023652 -0.056304 0.046627 0.025223 0.041890 0.229388 -0.058810 0.207155
polarizability: 2.49602542e+02 -4.65534902e+00 1.43423089e+02 6.76250660e+00 2.51984193e+00 1.32879040e+02
1716.lowfreq: -9.1830 -0.9356 -0.0016 0.0000 0.0019 9.2362 15.8281 18.8149 29.5203
frequency: 11.0689 18.2459 25.4498 32.0058 45.2212 52.5770 64.2881 74.2303 88.8558 94.5518 105.8405 114.6111 121.5309 137.2220 142.6830 172.2590 177.8200 193.5775 228.9044 232.3143 280.2397 287.1370 297.9469 355.3337 391.6615 414.8396 479.5077 499.2343 538.5531 552.4125 659.7992 721.7805 726.3286 727.7085 749.5959 767.8851 799.3348 824.1373 832.8996 885.4607 896.6577 917.1015 945.5539 967.9959 974.7618 991.7331 1001.1864 1006.5878 1021.8244 1049.1815 1059.0549 1069.3254 1073.6561 1078.8662 1091.5485 1099.0506 1108.2045 1110.9735 1113.5084 1133.6638 1148.0733 1164.3376 1200.2042 1207.6020 1213.3630 1237.5284 1247.5775 1250.8645 1266.4946 1270.9278 1279.5878 1283.5228 1286.6761 1292.1691 1293.6912 1298.8949 1303.4804 1320.0400 1337.3187 1346.0518 1349.6499 1356.4307 1365.0356 1390.2689 1422.4941 1439.8879 1453.3551 1456.6418 1457.8186 1461.7254 1463.5521 1464.9716 1466.2355 1469.5496 1476.2914 1477.4357 1479.4461 1486.9297 1487.4487 1648.3760 1684.4164 2946.7503 2948.4484 2950.5218 2952.0421 2960.6542 2960.7672 2968.2683 2969.5337 2972.3053 2983.3663 2986.8630 2994.4740 2996.1475 2999.1936 3002.9120 3007.6618 3012.9542 3023.7495 3033.6209 3038.3706 3042.8333 3058.0871 3062.8190 3067.8826 3069.8317 3070.7442 3103.6131 3147.2047
redmass: 4.6618 4.5806 3.1615 3.1264 2.2201 4.0428 2.4592 2.1305 2.3070 2.1761 1.0831 2.2462 3.7622 2.1901 2.0080 3.7354 2.9515 2.6094 1.1097 3.5209 3.9692 2.2259 3.1797 3.4164 3.9503 3.0989 3.3342 3.5355 2.6058 2.7150 4.8536 1.0651 1.0851 1.1088 1.2480 1.2776 1.3003 1.4882 5.2323 1.7428 1.4334 1.3751 6.3319 1.5156 1.1046 4.9093 1.9594 3.7017 2.4039 3.3957 1.4863 2.5344 2.1245 2.2225 3.3386 2.3227 2.0332 1.5913 1.2883 2.9497 1.4375 2.0897 1.5330 1.4003 1.3364 1.3194 1.2804 1.3343 1.1995 1.2081 1.0698 1.0848 1.2713 1.1365 1.1088 1.2062 1.2811 1.4092 1.4515 1.5531 1.5927 1.6343 1.6956 1.2154 1.1882 1.0827 1.0502 1.0835 1.0817 1.0769 1.0631 1.0515 1.0735 1.0922 1.0686 1.0441 1.0990 1.0803 1.1004 9.0778 6.6624 1.0621 1.0621 1.0590 1.0589 1.0597 1.0587 1.0602 1.0607 1.0363 1.0628 1.0962 1.0665 1.0918 1.0960 1.0297 1.0976 1.0988 1.1022 1.0988 1.1029 1.1033 1.0944 1.1027 1.0905 1.0979 1.0994 1.1044 1.1046
irintensity: 0.6505 0.2314 0.2209 0.0830 0.0114 0.0731 0.0196 0.0842 0.2375 0.1291 0.2126 0.3975 0.9054 0.5547 0.0168 2.7420 8.2217 0.8639 0.0454 3.8977 8.6910 3.0660 5.4187 3.7040 0.3906 3.7763 2.3377 1.3001 0.3434 1.9830 6.2968 15.1918 8.8687 0.3722 3.4233 0.9900 1.4521 0.6603 12.7201 3.8240 3.1098 5.4167 13.2064 3.7825 52.1020 0.7337 9.5537 0.0103 5.7464 14.9079 31.3445 0.1728 0.6320 9.7975 15.9502 4.1358 22.1492 9.6487 3.8598 212.7352 3.6961 2.2390 2.2629 19.9021 26.5782 1.6059 0.4181 24.3233 1.0605 0.7545 0.5620 0.2090 11.2339 0.1395 0.8427 0.2832 12.0953 14.0392 3.7090 6.4599 1.5851 3.4105 10.0492 11.4068 22.3665 21.0660 13.9213 3.6503 0.8513 0.2229 0.9343 11.1905 0.6592 5.1893 5.3751 11.9012 0.1084 14.5756 29.1057 161.9985 0.0011 26.1303 15.7824 0.1953 15.5380 16.3261 1.4095 83.1768 110.2700 46.5801 5.2919 4.1189 29.9471 13.3182 5.3943 35.8058 5.7011 0.8659 4.7220 0.8714 48.4072 98.2236 0.3967 80.4830 31.3414 159.0218 57.8660 29.6494 17.7894
temp: 298.150 k
press: 1.00000 atm
elementType: 8 8 6 6 6 6 6 6 6 6 6 6 6 6 6 6 6 1 1 1 1 1 1 1 1 1 1 1 1 1 1 1 1 1 1 1 1 1 1 1 1 1 1 1 1
symmnumber: 1
zpe: 1046573.8 jmol-1
zpe.correction: 0.398619 hartree
zpe.thermalcorrener: 0.421125 hartree
zpe.thermalcorrenthalpy: 0.422069 hartree
zpe.thermalcorrgfe: 0.341469 hartree
zpe.sumelectzpe: -737.435233 hartree
zpe.sumelectthermal: -737.412727 hartree
zpe.sumelectthermalent: -737.411783 hartree
zpe.sumelectthermalfe: -737.492383 hartree
dipole: 0.3509 -1.4684 -0.2621
dipole: 1.5323
quadrupole: -93.3646 -113.5951 -104.1225
quadrupole: -9.5352 -1.2223 -0.2267
quadrupole: 10.3295 -9.9011 -0.4284 -9.5352 -1.2223 -0.2267
hfenergy: -737.833852 hartree
pointgroup: C01 [X(C15H28O2)]
dipole: -0.1376807 0.5729193 -0.1275005 debye
polarizability: 249.610413|-4.9816109|143.1967498|-6.4509278|-2.956474|133.0975077 unknown
InChI: InChI=1S/C15H28O2/c1-3-4-5-6-7-8-9-10-11-12-13-14-15(16)17-2/h6-7H,3-5,8-14H2,1-2H3
charge 0 multiplicity 1
45 atoms
O  -7.715637 0.528751 -0.29737
O  -6.655033 -1.473167 0.242172
C  -1.457767 -0.140147 0.123185
C  -0.19228 0.746376 0.129875
C  -2.769992 0.670867 0.031157
C  1.118568 -0.063025 0.247446
C  -4.029921 -0.222072 0.025928
C  2.38513 0.834795 0.246745
C  -5.328076 0.603211 -0.066022
C  3.665531 0.052903 0.45395
C  5.991643 -0.773749 -0.202689
C  7.254872 0.129149 -0.195386
C  4.70985 0.004807 -0.414496
C  8.566972 -0.672688 -0.038181
C  -6.58431 -0.250491 -0.016502
C  9.82249 0.225927 -0.029226
C  -9.013477 -0.187438 -0.254035
H  -1.404435 -0.849899 -0.728367
H  -1.475407 -0.760844 1.043196
H  -0.252978 1.466692 0.972977
H  -0.16554 1.356081 -0.797618
H  -2.750591 1.293791 -0.887871
H  -2.82096 1.378515 0.88554
H  1.097037 -0.663192 1.180823
H  1.188682 -0.788503 -0.587725
H  -3.98329 -0.930699 -0.823653
H  -4.055851 -0.844257 0.940649
H  2.274307 1.588892 1.055856
H  2.439353 1.39834 -0.705853
H  -5.384518 1.331879 0.768002
H  -5.355896 1.208816 -0.991938
H  3.729477 -0.527157 1.3900
H  5.934774 -1.337354 0.749744
H  6.110005 -1.52742 -1.010983
H  7.293181 0.714056 -1.137991
H  7.168071 0.867966 0.626597
H  4.646364 0.584468 -1.350804
H  8.643445 -1.410958 -0.862885
H  8.523844 -1.260726 0.901394
H  9.905287 0.799966 -0.97152
H  9.782483 0.953617 0.803191
H  10.746976 -0.369478 0.086248
H  -9.764394 0.576895 -0.498477
H  -9.186099 -0.607639 0.751288
H  -9.023989 -1.006555 -0.992769
