program: Gaussian 09
title: 000143334
version: EM64L-G09RevD.01
frameworkgroup: C1[X(C9H13NO2)]
method: RPBEPBE
basis: SDD
operation: Freq
keyword: #p
keyword: freq=noraman
keyword: PBEPBE/SDD
title: #p freq=noraman PBEPBE/SDD
converged: YES YES NO NO
title: Mulliken charges:
elementType: O O N C C C C C C C C C H H H H H H H H H H H H H
charge: -0.316515 -0.291684 -0.185346 -0.164392 -0.186624 -0.494238 -0.433814 -0.445310 -0.233358 -0.154759 0.296650 -0.488112 0.280579 0.234830 0.256319 0.213897 0.228798 0.235198 0.221926 0.220667 0.225349 0.272429 0.239713 0.240187 0.227609
chargesum: 0.00000
title: Mulliken charges with hydrogens summed into heavy atoms:
elementType: O O N C C C C C C C C C
charge: -0.316515 -0.291684 -0.185346 0.116187 0.048205 -0.024022 0.030183 -0.002717 -0.008009 0.117670 0.296650 0.219398
polarizability: 1.45165886e+02 -8.23204407e+00 1.00990008e+02 -7.69769339e-01 -1.96452906e+00 7.63797868e+01
1716.lowfreq: 0.0009 0.0009 0.0011 14.2127 18.3341 26.1972 63.8798 80.7692 95.8072
frequency: 63.3884 80.7014 95.7697 135.0663 157.7107 183.6768 286.6005 296.1199 329.9112 390.7513 414.3948 498.0518 543.6957 585.4458 645.4195 686.8874 707.0685 740.0019 747.2491 791.1009 828.1184 862.6922 880.8861 887.5933 941.5363 947.2093 963.7884 972.2459 1002.7692 1053.5405 1068.0445 1078.7684 1107.8169 1118.2908 1143.3756 1147.0962 1157.7074 1196.3095 1204.2332 1224.0942 1269.4486 1283.3957 1299.5590 1305.7698 1309.4831 1317.0400 1349.8902 1399.2488 1433.3709 1451.2494 1457.7627 1458.6231 1469.3976 1478.8315 1633.4716 1647.6659 2990.7053 3002.2551 3013.3138 3018.1057 3049.0676 3061.5103 3085.6285 3091.0879 3100.5291 3103.7151 3141.8542 3157.8549 3209.0417
redmass: 3.2796 1.3576 3.2649 2.4356 3.1438 3.1471 3.5612 3.6427 3.7323 2.8925 2.2420 4.4853 5.1211 3.7267 4.5186 10.6108 2.0469 4.1608 1.9480 1.7311 2.6803 4.7000 3.0171 2.3245 1.4061 2.2684 2.0939 1.8533 2.5591 2.0441 2.6132 2.0279 1.4301 1.2532 1.2339 1.4037 1.3497 1.4028 1.6256 1.2194 2.2665 1.3420 1.6189 1.9536 1.9465 1.4965 1.5778 1.7471 1.2571 1.0502 1.0914 1.0807 1.0551 1.0995 10.0624 6.6652 1.0632 1.0295 1.0612 1.0633 1.0871 1.1010 1.1028 1.1043 1.0895 1.1047 1.1046 1.0898 1.0976
irintensity: 0.6406 0.0131 4.7811 3.4021 3.2354 2.4403 4.2818 16.6290 8.7252 1.4306 0.3217 5.9308 3.1090 3.2499 3.3047 11.8287 35.8341 8.4091 26.8167 7.8086 15.3349 6.3378 5.3855 17.9191 2.5613 15.4629 0.7400 8.3755 7.3542 83.7108 122.0036 24.3606 3.3139 0.0713 7.9814 79.5762 8.9645 44.0823 19.1541 1.9210 82.2271 4.2703 1.8438 144.6682 114.6786 28.6981 43.9321 17.8085 96.1632 12.9762 16.5560 4.7102 11.2250 8.9118 532.1194 3.8734 49.0756 51.1660 28.4233 40.0261 60.5441 7.5079 22.0329 36.7156 15.9047 30.1125 17.7145 9.0955 6.4098
temp: 298.150 k
press: 1.00000 atm
elementType: 8 8 7 6 6 6 6 6 6 6 6 6 1 1 1 1 1 1 1 1 1 1 1 1 1
symmnumber: 1
zpe: 548810.8 jmol-1
zpe.correction: 0.209031 hartree
zpe.thermalcorrener: 0.219985 hartree
zpe.thermalcorrenthalpy: 0.220929 hartree
zpe.thermalcorrgfe: 0.172053 hartree
zpe.sumelectzpe: -555.028253 hartree
zpe.sumelectthermal: -555.017299 hartree
zpe.sumelectthermalent: -555.016355 hartree
zpe.sumelectthermalfe: -555.065231 hartree
dipole: -1.0863 1.2821 -0.3334
dipole: 1.7132
quadrupole: -60.6510 -74.1027 -71.5629
quadrupole: 6.0031 -2.0112 -0.0032
quadrupole: 8.1212 -5.3305 -2.7907 6.0031 -2.0112 -0.0032
hfenergy: -555.2372836 hartree
pointgroup: C01 [X(C9H13N1O2)]
dipole: 0.4353745 0.4942598 0.1430235 debye
dipolederiv: -1.5281341 0.2389081 0.0942949 0.7583336 -0.6437506 -0.093387 0.2216467 -0.0789159 -0.3301513 -0.934307 -0.234003 -0.0270258 -0.4639456 -1.0416651 -0.1222136 -0.0448975 -0.1145308 -0.3665321 -1.5880625 -0.2550753 -0.0042847 -0.5749019 -0.7439937 -0.0382772 -0.0296995 -0.0795157 -0.2438544 0.3337365 -0.2187666 0.0022512 -0.3555347 0.2817297 -0.0220303 -0.0698476 -0.005355 0.2374422 0.2102069 0.0382043 -0.031678 0.0629953 0.007878 -0.0165904 -0.1628869 -0.0628117 0.1177866 -0.0634628 -0.0329829 0.0005663 -0.0123912 0.0445698 0.0380207 0.0470445 -0.0008342 0.0021975 -0.011103 0.014664 -0.0328762 0.0292388 0.0936886 0.0258329 -0.0411482 0.0501122 -0.0353592 0.0509299 -0.0577182 -0.0148252 -0.0491232 0.0434083 0.031455 0.069855 0.0719451 0.0621666 -0.1880352 -0.2088973 -0.0244757 -0.2366364 -0.0073228 0.0627653 -0.0421672 0.1118683 -0.3245884 0.2919964 0.3037728 -0.0033929 0.6592566 0.5324799 0.0783643 0.1043616 0.0961356 -0.0681362 2.6832535 0.2752003 -0.0367392 -0.0246323 1.3575837 0.222734 -0.1569796 0.1837892 0.3038676 0.8754798 -0.0592294 -0.0382172 0.0327873 0.2259183 -0.0122449 -0.0322731 -0.0081924 0.2859301 0.0505394 -0.0683244 -0.0495068 -0.0048576 -0.0074566 -0.0367569 -0.0244528 -0.0210807 0.0604002 -0.1319378 -0.0925821 0.0721988 -0.0842847 -0.000138 0.038675 0.0902592 0.0446641 0.0390323 0.0468207 0.0190015 -0.0916541 0.0046507 0.0361657 0.0962592 -0.0629127 0.0571034 -0.0974381 -0.0402063 0.10695 0.063606 0.125445 -0.0596236 -0.0826425 0.0463383 -0.0447699 0.0676583 0.0226694 0.0618956 -0.0096026 0.061728 -0.1529929 0.030999 -0.0201723 -0.010601 0.080851 -0.0096667 -0.0209844 0.1029632 -0.0015261 0.0685143 -0.0377086 0.0892793 0.0006821 -0.0690675 0.0685527 -0.0077429 -0.0104464 -0.0696618 0.0098453 -0.1014174 -0.0392513 -0.0803887 -0.1122933 -0.1808659 0.0853112 -0.0033914 0.182514 -0.0182316 0.0183565 0.0232619 -0.0113278 0.0632685 0.042957 -0.0366531 0.0039972 -0.0114962 -0.0988771 -0.0588595 0.0150454 -0.0661724 0.1594946 0.0707892 0.0736466 0.0249202 0.0369235 0.0372758 -0.0319559 0.0269133 -0.0349479 0.1725899 -0.0305517 0.0090122 0.0113765 -0.1060875 0.0174743 0.1212356 0.046404 0.0923896 -0.0313618 -0.0403648 0.0041298 -0.0160797 -0.0941235 0.0820375 -0.0684527 -0.0870763 -0.0507344 -0.0847248 -0.0012337 0.0622632 0.0180215 0.1353301 -0.0645174 -0.0421605 0.0333558 -0.0385112 0.1108217 unknown
polarizability: 145.4655629|7.380803|100.6312645|0.0815067|2.4165536|76.4388535 unknown
InChI: InChI=1S/C9H13NO2/c1-12-9(11)10-5-4-7-2-3-8(10)6-7/h4-5,7-8H,2-3,6H2,1H3
charge 0 multiplicity 1
25 atoms
O  -2.529161 0.748401 0.166886
O  -2.103703 -1.519506 -0.2836
N  -0.350463 0.039784 -0.108125
C  0.701246 -1.002429 -0.34204
C  2.455432 0.601007 -0.277687
C  1.785053 -0.393853 -1.266168
C  1.489478 -1.298162 0.974689
C  2.723098 -0.322116 0.955795
C  1.426176 1.67447 0.066996
C  0.098221 1.368311 0.12138
C  -1.683027 -0.346835 -0.093748
C  -3.967669 0.412347 0.197258
H  0.191574 -1.888394 -0.747777
H  3.381846 1.054011 -0.670087
H  1.366718 0.090046 -2.164353
H  2.492203 -1.1846 -1.577011
H  1.815417 -2.353793 0.984891
H  0.845061 -1.145221 1.856695
H  2.810722 0.255927 1.891667
H  3.667397 -0.882124 0.813814
H  1.747182 2.69946 0.274337
H  -0.685858 2.094327 0.338774
H  -4.175553 -0.32777 0.988292
H  -4.288879 0.001163 -0.774529
H  -4.471011 1.36705 0.407651
