program: Gaussian 09
title: 000143315
version: EM64L-G09RevD.01
frameworkgroup: C1[X(C10H8N2O2)]
method: RPBEPBE
basis: SDD
operation: Freq
keyword: #p
keyword: freq=noraman
keyword: PBEPBE/SDD
title: #p freq=noraman PBEPBE/SDD
converged: NO NO NO NO
title: Mulliken charges:
elementType: O O N N C C C C C C C C C C H H H H H H H H
charge: -0.230614 -0.248720 -0.053473 -0.070027 -0.080661 0.170712 0.234673 -0.017727 -0.352975 -0.312204 0.228859 0.220244 -0.763784 -0.761941 0.256268 0.259527 0.262426 0.249736 0.249735 0.250189 0.259568 0.250191
chargesum: 0.00000
title: Mulliken charges with hydrogens summed into heavy atoms:
elementType: O O N N C C C C C C C C C C
charge: -0.230614 -0.248720 -0.053473 -0.070027 -0.080661 0.170712 0.234673 -0.017727 -0.096708 -0.052677 0.228859 0.220244 -0.001888 -0.001994
polarizability: 1.95326862e+02 -2.53134167e-01 1.31491858e+02 -2.68980214e-03 -5.84464034e-04 5.98438534e+01
1716.lowfreq: -0.0010 -0.0006 -0.0005 7.4073 8.6110 16.1233 90.0937 103.9488 108.6088
frequency: 90.0649 103.9362 108.5961 138.0352 166.2510 226.2812 234.9013 277.1482 314.8271 372.6333 375.8232 435.9917 477.9199 523.0580 554.3326 623.1209 625.6699 627.4824 682.7504 697.3643 759.4327 762.7249 791.2199 815.3645 828.5332 845.9039 947.0034 977.4517 995.5713 1004.4557 1048.2882 1048.6432 1055.7651 1127.3235 1142.4067 1172.0185 1228.3735 1233.8899 1246.6420 1385.9321 1399.1352 1399.9814 1410.6924 1452.1443 1454.4823 1454.8409 1458.4681 1468.0476 1553.7138 1568.4871 1608.4507 1655.9184 2997.0817 2997.1452 3075.4518 3075.8431 3131.2042 3131.3284 3168.8475 3187.9229
redmass: 2.5779 1.0494 1.2688 3.7417 3.5211 6.7716 5.3543 3.0096 4.5365 6.5887 4.7595 5.3755 6.8134 4.0264 4.0213 5.7450 6.6502 5.5548 4.9165 5.6799 7.5948 8.5883 5.8485 1.5161 7.8689 8.4503 1.3271 2.4498 7.0282 2.1017 1.4860 1.4833 2.7302 2.3443 2.3551 3.2550 2.7210 6.7703 6.6117 2.7805 1.2446 1.2982 4.7019 1.8367 1.0438 1.0440 1.1070 1.8784 7.0017 8.1056 8.6608 10.8457 1.0381 1.0381 1.0976 1.0976 1.0986 1.0986 1.0888 1.0978
irintensity: 4.0870 0.4966 0.9410 0.1164 3.2629 0.9738 6.5686 3.3083 0.0238 0.2156 3.1117 0.0875 1.1563 0.0783 2.6184 0.9551 0.8111 0.7754 8.7529 14.2372 14.5215 0.6431 2.1039 56.1372 40.0185 28.2153 0.0285 10.4266 100.6658 6.5800 4.1326 6.7969 7.0319 38.5727 24.3769 64.1913 28.2909 0.7110 7.3365 44.6003 10.1404 9.9119 1.7010 20.4728 19.4393 18.2793 39.9521 0.7706 110.4056 29.7731 15.4984 6.8410 18.1185 5.2311 8.4271 9.2863 3.9597 3.8925 0.2159 4.0403
temp: 298.150 k
press: 1.00000 atm
elementType: 8 8 7 7 6 6 6 6 6 6 6 6 6 6 1 1 1 1 1 1 1 1
symmnumber: 1
zpe: 423013.4 jmol-1
zpe.correction: 0.161117 hartree
zpe.thermalcorrener: 0.172465 hartree
zpe.thermalcorrenthalpy: 0.173409 hartree
zpe.thermalcorrgfe: 0.123821 hartree
zpe.sumelectzpe: -644.829455 hartree
zpe.sumelectthermal: -644.818108 hartree
zpe.sumelectthermalent: -644.817163 hartree
zpe.sumelectthermalfe: -644.866751 hartree
dipole: -1.0236 0.0391 -0.0002
dipole: 1.0244
quadrupole: -64.0326 -78.8768 -81.0953
quadrupole: -4.0227 -0.0011 0.0002
quadrupole: 10.6357 -4.2086 -6.4271 -4.0227 -0.0011 0.0002
hfenergy: -644.9905724 hartree
pointgroup: C01 [X(C10H8N2O2)]
dipole: 0.4025191 -0.0202579 -0.0000672 debye
dipolederiv: -1.04654 0.0103244 -0.0000328 0.1927788 -0.5665973 0.0000168 -0.0000699 -0.000015 -0.086 -0.8528325 -0.1429459 -0.0000169 -0.1515457 -0.7065944 -0.000016 -0.0000262 -0.0000177 -0.1031504 -0.7193119 0.0103977 -0.0000066 0.0065223 -0.3249323 0.0000006 -0.000016 -0.0000008 -0.2179044 -0.4352252 0.1161382 -0.0000247 0.0952484 -0.5501538 -0.000006 -0.0000342 0.0000667 -0.2403197 0.2649256 0.1538177 0.0000087 0.3115798 0.0802384 0.0000083 0.0000107 0.0000145 0.0156157 0.3374977 -0.1163057 -0.0000108 -0.5744248 0.302343 -0.000006 0.0000074 -0.0000104 0.0720345 0.5219866 0.1770727 0.0000143 0.0097869 -0.0069489 -0.000001 0.0000195 -0.0000068 0.0536224 0.2900117 -0.1462526 -0.0000082 -0.0653921 -0.0877366 0.0000047 0.00003 -0.0000313 0.0139988 -0.188229 0.0358622 -0.0000054 -0.0776393 0.0837292 0.0000007 0.0000069 0.000012 -0.175481 0.0524759 -0.0656763 0.0000029 -0.0696726 0.1140582 -0.0000023 0.0000002 -0.0000051 -0.1461047 0.8660039 0.0325138 0.0000162 0.103887 0.8029327 0.0000187 0.0000318 0.0000208 0.0689868 0.9997512 -0.0524788 0.0000806 0.0917446 0.7383455 -0.0000227 -0.0000792 0.0000699 0.0620132 -0.2454799 -0.1200984 -0.0000084 -0.0088781 -0.0037287 0. -0.0000213 -0.0000088 0.0537465 -0.1395028 0.0769536 -0.000026 0.1883719 -0.0933082 0.0000184 0.0001863 -0.000121 0.056075 0.0524793 0.0715746 -0.0000005 0.0501381 -0.0074379 -0.0000019 -0.0000032 -0.0000014 0.1860003 0.062018 -0.0766484 -0.0000001 -0.0453604 -0.0047373 0. -0.000002 -0.000001 0.1729224 0.0900548 0.0489257 -0.0000024 -0.0278434 -0.0557353 0.0000019 0.000001 0.0000044 0.1344677 0.0044135 -0.016603 -0.0600563 -0.0067269 0.0825833 0.0731919 -0.1096635 0.040159 -0.0135126 0.0044064 -0.0165974 0.0600576 -0.0067185 0.0825793 -0.0731963 0.1096669 -0.0401616 -0.0134972 0.0467117 0.0284381 0.0285222 0.0475631 0.0440216 0.0900223 -0.0287089 0.1090973 -0.0138651 -0.0122595 -0.036983 -0.0000616 -0.1110847 0.0329716 -0.0000723 -0.0000942 -0.0000296 0.1343677 0.0466447 0.0285707 -0.0284419 0.0476656 0.044108 -0.0899597 0.0287579 -0.1090343 -0.0140156 unknown
polarizability: 195.3113713|-1.0260132|131.5073485|0.0026967|0.0005518|59.8438534 unknown
InChI: InChI=1S/C10H8N2O2/c1-5-11-7-3-4-8-9(10(7)14-5)12-6(2)13-8/h3-4H,1-2H3
charge 0 multiplicity 1
22 atoms
O  -1.641303 1.372487 0.000053
O  2.756922 -0.633696 0.000081
N  1.683585 1.421966 0.0001
N  -2.782232 -0.644834 0.000058
C  0.71411 0.383918 0.000052
C  -0.687476 0.343594 0.000046
C  1.364365 -0.888304 0.000035
C  -1.380691 -0.905076 0.000019
C  0.721199 -2.141332 0.000013
C  -0.690932 -2.143854 0.000012
C  2.854292 0.797285 0.000112
C  -2.901072 0.673946 -0.00008
C  4.225009 1.377241 0.000158
C  -4.130961 1.512283 -0.000165
H  1.291499 -3.073557 0.00001
H  -1.251265 -3.08239 0.000017
H  4.148277 2.4747 0.000142
H  4.793352 1.0536 0.890698
H  4.793419 1.053574 -0.890332
H  -4.166969 2.166266 -0.890049
H  -5.011105 0.852263 -0.000655
H  -4.16752 2.165621 0.890175
