program: Gaussian 09
title: 000143293
version: EM64L-G09RevD.01
frameworkgroup: C1[X(C8H12O)]
method: RPBEPBE
basis: SDD
operation: Freq
keyword: #pfreq=noraman
keyword: PBEPBE/SDD
title: #p freq=noraman PBEPBE/SDD
converged: YES YES NO NO
title: Mulliken charges:
elementType: O C C C C C C C C H H H H H H H H H H H H
charge: -0.182738 -0.218670 -0.218669 -0.454024 -0.454024 -0.447758 -0.447761 0.132287 -0.417662 0.257921 0.257921 0.205050 0.233204 0.233204 0.205050 0.222923 0.222928 0.222930 0.222924 0.210266 0.214698
chargesum: 0.00000
title: Mulliken charges with hydrogens summed into heavy atoms:
elementType: O C C C C C C C C
charge: -0.182738 0.039251 0.039251 -0.015770 -0.015770 -0.001907 -0.001907 0.132287 0.007303
polarizability: 8.22132701e+01 -2.02941393e+00 7.82379441e+01 -5.89658309e-04 -7.96110971e-05 7.83756121e+01
1716.lowfreq: -0.0010 -0.0009 -0.0008 14.2042 22.5517 35.6929 122.5065 174.2230 266.8001
frequency: 122.4990 174.1050 266.7807 269.6970 350.9514 402.7115 446.6058 472.4138 635.6843 687.9202 724.7824 762.5320 777.2164 819.8158 840.0678 854.1780 868.7422 953.0248 972.1156 976.0717 995.5971 1040.4510 1063.9096 1090.8902 1095.2329 1145.1231 1159.9234 1192.4113 1194.0593 1215.4060 1228.8644 1254.5121 1272.8508 1276.2892 1294.1346 1309.0562 1332.0777 1340.1715 1340.7614 1460.7317 1468.0031 1471.7137 1473.0663 1493.1009 1668.5639 2977.8780 2979.6046 2990.7397 2999.7890 3013.3254 3030.4748 3036.8920 3049.0892 3052.6819 3062.1020 3063.1378 3078.3530
redmass: 5.8819 1.9436 2.0611 2.1374 2.0176 4.1413 3.8426 3.3979 2.5553 4.4267 3.5548 1.7531 2.7857 2.5208 2.0311 1.3881 2.5918 2.4448 2.0115 2.3328 1.7342 1.9554 1.4382 1.8987 1.7369 1.1138 1.5656 1.6828 1.4719 1.2466 1.5165 1.6517 1.3412 1.3127 1.4321 1.4719 1.4608 1.3829 1.4084 1.0823 1.0778 1.0916 1.0785 1.0883 10.6643 1.0588 1.0593 1.0646 1.0589 1.0620 1.0987 1.1038 1.1021 1.1037 1.0896 1.0916 1.1027
irintensity: 2.9318 0.0789 0.1640 0.7997 0.9785 0.4572 5.5903 1.5900 2.6039 6.0829 0.6920 2.1346 4.9791 4.2775 2.6407 5.0455 1.2700 3.8348 0.4731 7.2689 15.1108 1.7565 17.3282 1.0124 0.0239 1.7063 2.4199 20.1000 1.6231 0.9638 3.0943 4.3097 2.6156 7.0783 1.5051 0.8343 0.1807 0.0037 0.3527 5.5058 6.6901 12.7256 10.7146 8.8088 217.8563 17.7455 53.6238 32.9481 25.6004 56.7248 34.9577 10.9422 9.9876 73.8601 39.3522 0.0188 59.7195
temp: 298.150 k
press: 1.00000 atm
elementType: 8 6 6 6 6 6 6 6 6 1 1 1 1 1 1 1 1 1 1 1 1
symmnumber: 1
zpe: 482028.6 jmol-1
zpe.correction: 0.183595 hartree
zpe.thermalcorrener: 0.191126 hartree
zpe.thermalcorrenthalpy: 0.192070 hartree
zpe.thermalcorrgfe: 0.151933 hartree
zpe.sumelectzpe: -386.568433 hartree
zpe.sumelectthermal: -386.560902 hartree
zpe.sumelectthermalent: -386.559958 hartree
zpe.sumelectthermalfe: -386.600095 hartree
dipole: -3.0438 1.8806 0.0005
dipole: 3.5778
quadrupole: -60.9108 -55.8488 -52.3916
quadrupole: 5.7007 0.0014 -0.0009
quadrupole: -4.5271 0.5349 3.9921 5.7007 0.0014 -0.0009
hfenergy: -386.7520284 hartree
pointgroup: C01 [X(C8H12O1)]
dipole: 1.1793162 0.7685289 -0.0001848 debye
dipolederiv: -0.8023239 -0.3474959 0.000081 -0.46054 -0.5331699 0.0000211 0.0001081 0.0000203 -0.4600802 -0.1658082 -0.1202338 -0.1909283 -0.0604972 -0.0000588 -0.0514886 -0.2388898 -0.0740799 -0.1540674 -0.1658015 -0.1201493 0.1909888 -0.0603852 -0.0000014 0.0514162 0.2389224 0.0740082 -0.154133 0.1486033 -0.0055913 0.0004211 0.0105515 0.0415195 0.0641278 -0.0258923 0.0245112 0.0217932 0.1486031 -0.0055919 -0.0004197 0.0105583 0.0414759 -0.0641333 0.0258859 -0.0245192 0.0218318 0.1598095 0.016247 0.0753837 -0.0728299 0.1095747 -0.0640932 -0.0043795 -0.0023033 0.0542092 0.1598009 0.0162172 -0.0753991 -0.0728275 0.1095984 0.0640704 0.0044054 0.0022768 0.0541793 0.8469892 0.5685052 -0.0001301 0.6804316 0.3634424 0.000094 -0.0001563 0.0000961 0.8095841 0.0120038 0.0183474 -0.0000038 0.0534612 0.1372165 -0.0000298 -0.0000106 -0.0000294 0.0150849 0.003676 0.0018079 0.1063217 -0.0095247 0.0368741 0.0276107 0.0909313 0.0222627 -0.0974085 0.0036723 0.0017607 -0.106324 -0.0095645 0.036852 -0.0276679 -0.0909293 -0.0223213 -0.0973815 -0.0898593 -0.1190047 -0.1033814 -0.0602583 0.03284 -0.0298385 -0.0601099 -0.0232338 0.0069554 -0.0476259 0.1385278 0.0853665 0.0885449 -0.0336783 -0.0487298 0.0433414 -0.0512388 0.01078 -0.047621 0.1384904 -0.0854289 0.0885251 -0.0336364 0.0487522 -0.0433823 0.0512616 0.0107326 -0.0898644 -0.1189553 0.1034343 -0.060228 0.0328701 0.0298217 0.0601379 0.0232189 0.0069303 0.035708 -0.0352671 0.0327241 -0.0116961 -0.1597078 0.0711914 0.0169638 0.0129843 0.0642795 -0.0428764 -0.0154808 -0.1171103 -0.0309775 0.0632663 -0.0737032 -0.0901048 -0.0349231 -0.1192341 -0.0428734 -0.0154238 0.1171181 -0.0309299 0.0633192 0.0736148 0.0901189 0.0348367 -0.1192901 0.0357074 -0.0352852 -0.0327069 -0.0117097 -0.1597445 -0.071085 -0.0169572 -0.0128773 0.0643218 0.058167 -0.081259 0.0000192 -0.1308492 -0.1338367 0.0000349 0.0000313 0.0000337 0.0084971 -0.1180865 0.1198343 -0.0000261 0.1507452 -0.0150151 0.0000143 -0.0000343 0.0000156 0.0524155 unknown
polarizability: 82.1131084|2.1228904|78.3381057|-0.0005914|0.0000654|78.3756121 unknown
InChI: InChI=1S/C8H12O/c9-8-6-2-1-3-7(8)5-4-6/h6-7H,1-5H2
charge 0 multiplicity 1
21 atoms
O  -2.037382 -1.258124 0.000293
C  -0.336283 0.12904 1.210637
C  -0.336304 0.128498 -1.21071
C  -0.115419 1.611478 0.789835
C  -0.115415 1.611121 -0.790565
C  1.011937 -0.667628 1.291166
C  1.011905 -0.668228 -1.290908
C  -1.076901 -0.451113 0.0001
C  1.855392 -0.484383 0.000075
H  -0.907888 0.008041 2.145667
H  -0.907928 0.007094 -2.145676
H  0.828487 2.012172 1.201349
H  -0.935403 2.242721 1.175669
H  -0.935385 2.242205 -1.176692
H  0.828502 2.011607 -1.202256
H  0.781309 -1.739904 1.447454
H  1.58698 -0.326066 2.173649
H  1.586933 -0.327094 -2.173567
H  0.781257 -1.740573 -1.446684
H  2.301496 0.528867 -0.000168
H  2.703408 -1.195531 0.000234
