program: Gaussian 09
title: 000143272
version: EM64L-G09RevD.01
frameworkgroup: C1[X(C8H14O2)]
method: RPBEPBE
basis: SDD
operation: Freq
keyword: #pfreq=noraman
keyword: PBEPBE/SDD
title: #p freq=noraman PBEPBE/SDD
converged: YES YES NO NO
title: Mulliken charges:
elementType: O O C C C C C C C C H H H H H H H H H H H H H H
charge: -0.283661 -0.283661 -0.239707 -0.239706 0.332338 0.332338 -0.684861 -0.684861 -0.681864 -0.681864 0.209477 0.209422 0.209477 0.209421 0.206513 0.230806 0.230822 0.206513 0.230806 0.230822 0.221670 0.249044 0.221670 0.249044
chargesum: 0.00000
title: Mulliken charges with hydrogens summed into heavy atoms:
elementType: O O C C C C C C C C
charge: -0.283661 -0.283661 0.179193 0.179193 0.332338 0.332338 -0.016720 -0.016720 -0.211150 -0.211149
polarizability: 1.19710194e+02 -1.31236971e+00 1.13283283e+02 -1.67638628e-04 -3.22437948e-03 6.05455457e+01
1716.lowfreq: -15.7799 -13.9693 -0.0010 -0.0007 -0.0007 3.1614 38.7991 79.9243 96.4285
frequency: 38.7983 79.9243 96.3621 106.9242 119.7085 127.4095 188.3272 242.5884 246.8345 315.9502 315.9858 378.1037 383.3570 406.9037 506.3226 593.5167 675.3546 684.5079 723.2409 797.8009 811.8840 826.0437 826.1907 861.6207 861.8468 874.5229 958.6165 964.2220 1043.5947 1056.9803 1113.7159 1117.1315 1139.0131 1139.0718 1183.7929 1256.2414 1256.6169 1312.3423 1348.6219 1380.1592 1395.0934 1400.0566 1408.6326 1414.9368 1462.1254 1462.1528 1478.1462 1479.0548 1490.4990 1491.3548 1589.5360 1646.7125 2954.3887 2954.6994 2996.3232 2996.4422 3010.5299 3010.8058 3093.1964 3093.2174 3104.7824 3104.8623 3141.2208 3141.6299 3250.8374 3251.6154
redmass: 3.2699 2.8540 4.0779 3.3678 2.1232 1.8118 3.2203 1.1679 1.2199 4.1080 3.0382 3.0095 2.8479 2.7170 3.5740 2.6493 1.2408 2.2632 1.4100 3.4560 3.0897 1.0912 1.0900 1.3492 1.4136 2.0236 2.2453 2.2405 2.4464 3.5208 2.2901 2.2006 1.4482 1.4498 3.2531 1.1391 1.1379 2.2783 1.3418 1.5205 1.2223 1.2697 1.2710 1.3952 1.0401 1.0401 1.0506 1.0487 1.0794 1.0842 4.7176 6.4526 1.0555 1.0556 1.0362 1.0362 1.1072 1.1072 1.0988 1.0988 1.1013 1.1013 1.0606 1.0619 1.1144 1.1144
irintensity: 0.1896 12.5153 0.0018 1.9736 0.3215 0.0000 0.0000 1.5717 0.0000 0.0000 0.1594 10.4266 0.0000 0.3857 0.0000 4.7701 1.5454 0.0001 0.0001 0.0000 11.8399 0.0016 26.4808 178.1709 0.0005 0.0014 0.0001 33.8198 103.3441 0.0002 24.5191 0.0001 8.9625 0.0010 415.2239 0.1089 0.0005 0.0000 44.9858 0.0000 56.3588 0.0003 24.7726 0.0000 0.0014 23.3713 20.3088 0.0001 18.0002 0.0000 206.1746 0.0000 63.0084 0.0053 44.9764 0.0023 0.0073 73.9560 58.1839 0.0900 0.0203 73.4478 0.0001 13.2033 10.5581 0.0000
temp: 298.150 k
press: 1.00000 atm
elementType: 8 8 6 6 6 6 6 6 6 6 1 1 1 1 1 1 1 1 1 1 1 1 1 1
symmnumber: 1
zpe: 533432.8 jmol-1
zpe.correction: 0.203174 hartree
zpe.thermalcorrener: 0.215396 hartree
zpe.thermalcorrenthalpy: 0.216341 hartree
zpe.thermalcorrgfe: 0.164635 hartree
zpe.sumelectzpe: -462.832443 hartree
zpe.sumelectthermal: -462.820221 hartree
zpe.sumelectthermalent: -462.819276 hartree
zpe.sumelectthermalfe: -462.870982 hartree
dipole: 0.0000 0.0000 0.0054
dipole: 0.0054
quadrupole: -45.1217 -60.4522 -64.6173
quadrupole: 5.0779 -0.0004 -0.0003
quadrupole: 11.6087 -3.7218 -7.8869 5.0779 -0.0004 -0.0003
hfenergy: -463.0356169 hartree
pointgroup: C01 [X(C8H14O2)]
dipole: 0. -0.0000014 -0.0021381 debye
dipolederiv: -1.5434215 -0.2341292 -0.0000666 -0.1178521 -0.494958 0.00001 -0.0000945 0.000233 -0.2697214 -1.5434206 -0.2341281 0.0000471 -0.1178519 -0.4949573 -0.0000368 0.0000895 -0.0002599 -0.2697215 0.9105032 0.0190888 0.0001374 -0.2699666 0.2416926 0.0000655 0.0005161 0.0002168 0.3978927 0.9105035 0.0190888 -0.0001388 -0.2699667 0.2416931 -0.0000825 -0.0005539 -0.0002359 0.397893 0.982612 0.1687289 -0.0003493 0.481337 0.5936964 0.0000557 -0.0008967 -0.0000506 0.0977264 0.9826121 0.168728 0.0003646 0.4813363 0.5936968 0.0000024 0.0009511 0.0001118 0.0977262 -0.1067415 -0.0900453 -0.000248 -0.0683999 0.0183659 -0.0002656 -0.0003527 -0.0002991 0.0578727 -0.1067422 -0.0900453 0.0002391 -0.0683997 0.0183659 0.0002615 0.0003464 0.0002952 0.0578729 -0.2000217 0.0425527 -0.0003565 -0.2360023 -0.486454 -0.0000187 -0.0001304 0.0001912 -0.4908797 -0.2000224 0.0425508 0.0003602 -0.2360027 -0.4864539 0.0000206 0.0000996 -0.0001904 -0.4908791 -0.0413197 -0.0375723 -0.0295269 0.0859514 -0.0361758 -0.1118905 0.019626 -0.1060987 -0.0910832 -0.0410336 -0.0380292 0.0299182 0.0856085 -0.0365377 0.1119913 -0.0193181 0.1058184 -0.090542 -0.0413204 -0.0375745 0.0295215 0.0859548 -0.0362017 0.1118963 -0.0196162 0.1061061 -0.0910578 -0.0410328 -0.0380272 -0.0299239 0.0856051 -0.0365122 -0.1119858 0.0193277 -0.1058114 -0.0905678 -0.136548 0.0776645 -0.000265 0.1152104 0.0246555 0.0001152 -0.0002717 0.0000592 0.1135231 0.1084719 0.0193912 0.0268901 -0.0458302 0.0088528 -0.1051318 -0.003551 -0.1117005 -0.0631241 0.1085467 0.01908 -0.0263315 -0.0462276 0.0084727 0.1051329 0.004061 0.111914 -0.0627769 -0.1365478 0.0776646 0.000277 0.1152103 0.0246555 -0.000127 0.0002881 -0.0000705 0.1135231 0.1084716 0.0193956 -0.0268898 -0.0458294 0.008827 0.1051409 0.0035436 0.1117088 -0.0630978 0.108547 0.0190754 0.0263316 -0.0462286 0.0084984 -0.1051237 -0.0040686 -0.1119058 -0.0628032 -0.0502543 0.1095433 0.0001672 0.1033986 0.0464119 -0.0000162 0.0001723 -0.0000575 0.2017624 0.0092062 -0.0562729 0.0001236 -0.0872271 0.111977 0.0000545 0.0001906 0.0000273 0.1993499 -0.0502544 0.1095439 -0.0001519 0.1033989 0.0464115 -0.0000039 -0.0001577 0.0000368 0.2017623 0.0092068 -0.0562725 -0.0001294 -0.0872269 0.1119774 -0.0000643 -0.0002004 -0.0000385 0.1993499 unknown
polarizability: 119.7283381|1.2670342|113.2651393|-0.000145|0.0032255|60.5455457 unknown
InChI: InChI=1S/C8H14O2/c1-5-9-7(3)8(4)10-6-2/h3-6H2,1-2H3
charge 0 multiplicity 1
24 atoms
O  -1.79426 -0.253926 -0.276146
O  1.794219 0.253993 -0.276126
C  -3.040607 0.532029 -0.277718
C  3.040566 -0.531962 -0.277805
C  -0.584999 0.461711 -0.276741
C  0.584958 -0.461645 -0.276802
C  -4.196148 -0.46569 -0.28062
C  4.196107 0.465756 -0.280603
C  -0.471443 1.821534 -0.277262
C  0.4714 -1.821467 -0.27749
H  -3.063741 1.180479 0.622685
H  -3.060772 1.182238 -1.176889
H  3.06371 -1.180519 0.622521
H  3.060719 -1.182065 -1.177054
H  -5.161767 0.072073 -0.281729
H  -4.153233 -1.10914 -1.175956
H  -4.156301 -1.110861 0.613626
H  5.161726 -0.072007 -0.281787
H  4.153181 1.109313 -1.175863
H  4.156272 1.11082 0.61372
H  -1.333814 2.491979 -0.276807
H  0.525583 2.263274 -0.278026
H  1.333771 -2.491913 -0.277124
H  -0.525626 -2.263206 -0.278303
