program: Gaussian 09
title: 000143250
version: EM64L-G09RevD.01
frameworkgroup: C1[X(C12H15ClO2)]
method: RPBEPBE
basis: SDD
operation: Freq
keyword: #p
keyword: freq=noraman
keyword: PBEPBE/SDD
title: #p freq=noraman PBEPBE/SDD
converged: YES YES NO NO
title: Mulliken charges:
elementType: Cl O O C C C C C C C C C C C C H H H H H H H H H H H H H H H
charge: -0.077050 -0.286089 -0.256243 -0.363879 -0.389356 -0.313704 -0.270307 -0.601272 0.194651 0.216860 -0.340306 -0.337997 -0.220772 -0.217809 -0.222338 0.197538 0.197013 0.215539 0.215929 0.222736 0.222442 0.227421 0.228288 0.260441 0.260414 0.270194 0.269160 0.233886 0.231674 0.232936
chargesum: 0.00000
title: Mulliken charges with hydrogens summed into heavy atoms:
elementType: Cl O O C C C C C C C C C C C C
charge: -0.077050 -0.286089 -0.256243 0.030673 0.042111 0.131474 0.185402 -0.080417 0.194651 0.216860 -0.070112 -0.068837 0.013114 0.013865 0.010598
polarizability: 2.14810878e+02 3.01233892e+00 1.45769482e+02 -4.24100190e-01 3.90333637e-01 7.76274064e+01
1716.lowfreq: -11.6030 -0.0025 -0.0024 -0.0022 2.6166 3.5871 13.8448 32.3698 33.8044
frequency: 13.6323 32.0608 33.7373 50.7652 75.0282 100.7745 101.2824 127.7661 139.0382 158.2477 206.2906 212.8492 284.3446 334.1757 403.4503 408.3789 427.6296 442.1995 510.5731 613.7715 661.0834 680.2074 680.6553 701.7764 739.9414 764.9758 795.7437 802.4875 825.7185 864.8742 914.8479 942.1292 954.6156 990.3344 996.0765 1008.8700 1018.8616 1025.3634 1032.9230 1058.3910 1067.3969 1076.7650 1087.4740 1103.8113 1155.2073 1173.9323 1181.2171 1223.1398 1228.8448 1243.0590 1267.1278 1277.7095 1288.7242 1293.3429 1314.4638 1327.1476 1354.9593 1378.2041 1389.6527 1438.4118 1456.1308 1467.9388 1469.3249 1476.7991 1479.1644 1488.8996 1584.1272 1611.0230 1620.1050 2963.2657 2991.6904 2998.2751 3001.2173 3008.6965 3043.5709 3046.4882 3059.5471 3075.7156 3128.9604 3130.2948 3142.4664 3155.2251 3166.7171 3178.0308
redmass: 4.5883 2.7253 4.0321 4.1405 4.5561 2.3283 4.5475 2.5867 2.6309 9.4988 4.1570 4.6968 5.8922 6.1575 2.8234 5.3990 3.7161 3.6636 6.0863 6.4428 6.8602 6.2170 5.0145 1.5920 1.0655 1.1056 2.1771 8.6691 1.2078 1.2447 8.1479 1.2371 1.4215 6.2606 1.3850 1.3294 3.2865 3.4463 4.2353 3.0695 1.1542 2.3315 1.8341 3.4691 1.3570 1.0572 1.1254 1.3612 1.2227 3.2923 1.1655 1.2527 1.1285 1.0757 1.3207 1.3277 1.4928 1.5592 10.1572 2.2470 1.0978 1.0840 1.0729 1.8694 1.2177 1.0993 6.8855 6.1795 10.1518 1.0588 1.0599 1.0593 1.0570 1.1007 1.1037 1.0564 1.1050 1.1073 1.1114 1.0854 1.0891 1.0938 1.0978 1.0980
irintensity: 1.6900 1.3347 1.3289 2.1913 0.0938 0.4932 1.8032 0.1258 1.1887 0.1065 2.9646 0.5932 22.8933 0.9218 0.0077 8.1333 1.1762 0.4168 4.3578 0.5579 4.8755 42.0863 13.5507 95.1343 11.2545 1.2668 22.2954 6.2872 1.0509 0.0267 12.5178 0.6404 3.9681 1.4203 0.0824 0.4104 33.7820 52.8933 0.5961 279.2360 0.1869 1.0801 37.4992 17.3250 1.6474 0.1972 46.6163 0.0928 2.1840 366.1240 0.1394 44.3138 1.3503 0.4237 1.9391 9.6917 2.1976 0.8078 2.8599 16.3326 2.3613 0.3058 0.5844 5.7363 3.4755 18.4989 43.1959 11.6261 164.0930 20.5186 2.4480 2.1705 60.7750 9.1016 0.2647 29.2672 9.8689 78.7280 27.4543 0.1726 10.9267 15.1305 21.7155 9.2459
temp: 298.150 k
press: 1.00000 atm
elementType: 17 8 8 6 6 6 6 6 6 6 6 6 6 6 6 1 1 1 1 1 1 1 1 1 1 1 1 1 1 1
symmnumber: 1
zpe: 638507.6 jmol-1
zpe.correction: 0.243195 hartree
zpe.thermalcorrener: 0.258872 hartree
zpe.thermalcorrenthalpy: 0.259817 hartree
zpe.thermalcorrgfe: 0.195848 hartree
zpe.sumelectzpe: -1075.666172 hartree
zpe.sumelectthermal: -1075.650495 hartree
zpe.sumelectthermalent: -1075.649550 hartree
zpe.sumelectthermalfe: -1075.713519 hartree
dipole: 1.8317 0.6639 0.0790
dipole: 1.9499
quadrupole: -104.0519 -97.5731 -97.5411
quadrupole: 16.7651 -0.4677 0.1078
quadrupole: -4.3298 2.1490 2.1809 16.7651 -0.4677 0.1078
hfenergy: -1075.9093671 hartree
pointgroup: C01 [X(C12H15Cl1O2)]
dipole: -0.7291174 0.2365068 -0.031151 debye
polarizability: 214.9042845|-0.5639849|145.4514083|2.1995161|3.609801|77.852074 unknown
InChI: InChI=1S/C12H15ClO2/c13-9-5-2-6-10-15-12(14)11-7-3-1-4-8-11/h1,3-4,7-8H,2,5-6,9-10H2
charge 0 multiplicity 1
30 atoms
Cl 7.499338 1.19368 0.234726
O  -0.175612 -0.186754 -0.040387
O  -1.273764 -2.238402 -0.156288
C  3.631971 -0.524083 -0.001794
C  2.228762 0.126924 0.029722
C  4.758714 0.532611 0.119707
C  1.120126 -0.921732 -0.065644
C  6.141251 -0.118428 0.079097
C  -1.325649 -0.984015 -0.09396
C  -2.576813 -0.172662 -0.067602
C  -3.817325 -0.861474 -0.106361
C  -2.555582 1.245318 -0.006686
C  -5.026894 -0.137764 -0.084327
C  -3.768876 1.964998 0.014568
C  -5.004951 1.276525 -0.02398
H  3.755675 -1.094178 -0.945627
H  3.719718 -1.258653 0.825252
H  2.102933 0.704604 0.965343
H  2.127172 0.84208 -0.808816
H  4.644425 1.093785 1.066436
H  4.673993 1.266797 -0.703859
H  1.174654 -1.507088 -1.002729
H  1.139687 -1.631814 0.782184
H  6.31041 -0.8073 0.92133
H  6.342082 -0.627605 -0.876367
H  -3.807977 -1.955511 -0.15312
H  -1.593497 1.764135 0.022975
H  -5.983257 -0.670811 -0.114002
H  -3.753097 3.059301 0.060968
H  -5.945515 1.838616 -0.007258
