program: Gaussian 09
title: 000143247
version: EM64L-G09RevD.01
frameworkgroup: C1[X(C10H22O)]
method: RPBEPBE
basis: SDD
operation: Freq
keyword: #pfreq=noraman
keyword: PBEPBE/SDD
title: #p freq=noraman PBEPBE/SDD
converged: YES YES NO NO
title: Mulliken charges:
elementType: O C C C C C C C C C C H H H H H H H H H H H H H H H H H H H H H H
charge: -0.467056 0.330434 0.337251 -0.420727 -0.444108 -0.389356 -0.736493 -0.754295 -0.729933 -0.732666 -0.734779 0.196009 0.236847 0.211385 0.193716 0.186261 0.197992 0.197562 0.205825 0.246207 0.218668 0.214714 0.206094 0.206904 0.208651 0.208238 0.219849 0.201748 0.211962 0.206190 0.216014 0.206985 0.343903
chargesum: 0.00000
title: Mulliken charges with hydrogens summed into heavy atoms:
elementType: O C C C C C C C C C C
charge: -0.123153 0.330434 0.337251 0.012129 -0.039007 -0.005103 -0.086899 -0.114818 -0.106140 -0.099106 -0.105590
polarizability: 1.24097112e+02 -9.21213047e-01 1.08941044e+02 4.10918586e-01 -2.38565527e-01 1.03196659e+02
1716.lowfreq: -15.6482 -5.4517 -0.0005 0.0005 0.0009 6.6478 13.5203 49.3775 85.7700
frequency: -7.2450 49.3547 85.6330 131.7067 150.2504 190.3687 201.7059 205.3178 232.0883 235.8280 237.7753 248.9119 261.4192 287.6260 316.6726 327.2338 343.6702 376.3284 402.0906 424.1508 469.2935 488.3741 504.2380 728.2197 752.7824 766.6806 900.5538 908.2786 909.7748 921.1457 925.9268 933.4596 934.9724 937.9378 966.4701 996.8723 1010.5322 1016.0200 1057.2440 1074.4449 1128.1650 1139.8220 1170.1795 1202.2110 1226.3538 1240.8504 1258.2466 1279.8504 1287.8384 1305.6814 1328.0030 1357.0732 1369.8664 1372.0590 1372.9780 1382.9471 1397.0432 1407.7529 1447.6162 1456.7800 1458.9780 1464.3197 1465.5697 1468.2161 1470.3549 1474.8261 1478.8327 1482.9290 1484.2749 1492.3049 1494.9749 2931.5309 2954.6076 2960.0898 2965.3872 2967.5806 2970.8701 2971.9264 2978.3671 2983.8474 3010.5881 3052.5041 3055.2742 3056.7604 3056.8358 3060.5466 3062.8866 3065.2701 3068.0088 3069.4323 3073.7366 3087.8009 3579.1718
redmass: 2.8927 3.8712 2.1205 2.7751 2.2660 1.0827 1.5644 1.6126 1.1026 1.1599 1.2511 1.1013 1.5707 2.5880 1.9810 2.1228 2.4598 2.3606 2.1134 2.1093 2.7777 2.3430 3.1821 3.7597 1.4295 2.3366 1.9799 2.0286 2.3491 1.8314 1.5565 1.4399 1.3051 1.2821 2.2738 2.0175 1.4450 1.4541 1.4909 2.7506 1.4252 1.4542 1.4248 1.8592 2.2961 1.8888 2.4588 1.8216 1.9931 1.5899 1.2515 1.4527 1.2137 1.2029 1.2035 1.2625 1.2110 1.3340 1.0775 1.0511 1.0629 1.0557 1.0499 1.0759 1.0531 1.0592 1.0622 1.0607 1.0626 1.0677 1.0611 1.0547 1.0562 1.0357 1.0352 1.0357 1.0375 1.0382 1.0637 1.1034 1.0980 1.1001 1.1000 1.0994 1.0994 1.0989 1.0985 1.0984 1.0987 1.0989 1.0980 1.0989 1.0666
irintensity: 0.1406 0.9448 0.5266 1.1689 9.0882 0.0184 4.4504 2.9352 0.2953 60.8726 80.7186 0.6155 1.6088 2.2400 0.3177 0.4946 2.0270 0.0547 0.4331 0.1748 2.4052 0.6335 7.3865 0.9346 3.8609 11.3601 3.9268 8.1226 0.9070 1.0253 0.6416 4.2075 2.5567 0.5965 45.7981 24.4787 3.5158 0.4121 0.9100 0.2711 3.3900 39.1278 4.9052 3.9048 3.2109 13.7525 16.2825 3.5920 10.5925 14.6443 1.0571 1.2400 27.9098 40.2967 5.5699 15.9023 11.5773 4.0026 0.3007 0.0637 4.7266 1.1511 0.9277 1.4519 1.2322 12.7740 6.1795 9.6081 5.8589 13.5161 42.0796 59.0872 24.4822 46.1445 36.9113 39.3485 54.6547 2.8151 29.3262 73.1816 19.6517 9.5488 3.0066 11.5874 1.8344 71.4178 104.0206 86.9812 42.4484 40.3676 74.1012 27.9089 2.2424
temp: 298.150 k
press: 1.00000 atm
elementType: 8 6 6 6 6 6 6 6 6 6 6 1 1 1 1 1 1 1 1 1 1 1 1 1 1 1 1 1 1 1 1 1 1
symmnumber: 1
zpe: 785116.8 jmol-1
zpe.correction: 0.299035 hartree
zpe.thermalcorrener: 0.313356 hartree
zpe.thermalcorrenthalpy: 0.314300 hartree
zpe.thermalcorrgfe: 0.259758 hartree
zpe.sumelectzpe: -468.532424 hartree
zpe.sumelectthermal: -468.518103 hartree
zpe.sumelectthermalent: -468.517159 hartree
zpe.sumelectthermalfe: -468.571701 hartree
dipole: 0.7845 0.2592 -1.5122
dipole: 1.7232
quadrupole: -70.5114 -69.6222 -72.5966
quadrupole: 2.3019 -3.9946 -3.4942
quadrupole: 0.3987 1.2879 -1.6866 2.3019 -3.9946 -3.4942
hfenergy: -468.8314596 hartree
pointgroup: C01 [X(C10H22O1)]
dipole: 0.3080364 -0.0735057 0.5994376 debye
polarizability: 124.091514|0.958631|108.9141149|-0.4193018|-0.5003863|103.2291847 unknown
InChI: InChI=1S/C10H22O/c1-9(2,3)6-7-10(4,5)8-11/h11H,6-8H2,1-5H3
charge 0 multiplicity 1
33 atoms
O  2.010037 -2.009618 0.058827
C  1.803281 0.432072 -0.013506
C  -2.218784 -0.030506 0.001636
C  0.341252 0.273612 -0.542917
C  -0.75078 0.076549 0.532435
C  2.212586 -0.783188 0.851125
C  2.757764 0.531507 -1.232879
C  1.953701 1.705968 0.859539
C  -3.151944 -0.258262 1.222526
C  -2.36795 -1.229349 -0.972764
C  -2.647032 1.278273 -0.714839
H  0.112595 1.175182 -1.146606
H  0.331739 -0.591952 -1.230137
H  -0.532957 -0.851771 1.09888
H  -0.717542 0.913163 1.260941
H  3.281161 -0.676711 1.141565
H  1.598416 -0.814421 1.776467
H  3.802514 0.702394 -0.908264
H  2.464835 1.372377 -1.88942
H  2.728988 -0.401396 -1.822103
H  1.652169 2.601773 0.28526
H  1.32997 1.66429 1.771749
H  3.005032 1.848176 1.175982
H  -3.076743 0.579223 1.942719
H  -4.209016 -0.338315 0.904666
H  -2.886413 -1.190915 1.756367
H  -1.773664 -1.084233 -1.892824
H  -3.425787 -1.356562 -1.272379
H  -2.03096 -2.170179 -0.497602
H  -3.710304 1.225283 -1.01723
H  -2.049762 1.460127 -1.626808
H  -2.527129 2.15349 -0.047478
H  2.319626 -2.79218 0.578472
