program: Gaussian 09
title: 000143227
version: EM64L-G09RevD.01
frameworkgroup: C1[X(C14H18O2)]
method: RPBEPBE
basis: SDD
operation: Freq
keyword: #pfreq=noraman
keyword: PBEPBE/SDD
title: #p freq=noraman PBEPBE/SDD
converged: YES YES NO NO
title: Mulliken charges:
elementType: O O C C C C C C C C C C C C C C H H H H H H H H H H H H H H H H H H
charge: -0.310939 -0.270168 -0.174518 -0.167928 -0.014335 -0.495615 -0.505156 -0.488972 -0.525452 0.359469 -0.340801 -0.386244 -0.366400 -0.325336 0.310450 -0.536917 0.258800 0.237807 0.183700 0.238284 0.226946 0.218120 0.239803 0.243880 0.228778 0.237785 0.260471 0.246215 0.252901 0.236535 0.250269 0.217326 0.243301 0.217944
chargesum: 0.00000
title: Mulliken charges with hydrogens summed into heavy atoms:
elementType: O O C C C C C C C C C C C C C C
charge: -0.310939 -0.270168 0.084281 0.069878 0.169365 -0.030384 -0.047233 -0.016314 -0.027196 0.359469 -0.094586 -0.133343 -0.129866 -0.075067 0.310450 0.141655
polarizability: 2.12318701e+02 -5.39779483e-01 1.22950183e+02 -2.98732010e+00 -9.75991969e+00 1.34080418e+02
1716.lowfreq: -11.0566 -2.5546 -0.0003 0.0006 0.0006 6.2431 29.9730 43.3839 71.4048
frequency: 29.1295 43.3529 71.3996 72.9987 86.7416 99.6543 140.2312 147.5474 203.2946 219.9374 244.4513 262.2213 285.7157 318.0725 358.8577 402.4603 416.1649 437.7278 479.7259 510.6777 522.3736 579.3643 634.5984 708.6586 716.9768 753.8472 775.6780 784.6738 792.1846 806.7492 813.8681 826.7084 830.6196 852.0122 898.7658 907.6237 916.6553 930.7997 950.8998 952.4387 989.2611 997.6790 1008.6026 1038.1624 1047.2965 1060.9706 1077.3802 1098.7858 1103.1915 1107.0522 1111.9686 1113.0801 1154.3716 1161.6167 1167.3408 1172.0842 1175.5661 1194.1634 1208.0933 1218.1255 1233.1882 1275.8817 1296.2304 1311.8028 1362.3896 1374.3434 1394.2206 1423.6336 1435.5871 1436.1648 1443.3996 1465.1382 1469.2206 1471.2755 1474.2456 1491.6643 1585.1466 1622.7666 2952.0603 2960.3488 3036.5223 3090.3857 3097.0106 3099.1363 3101.5591 3110.3464 3120.6286 3127.7472 3145.3820 3153.2040 3165.7085 3174.8086 3188.3638 3198.1488 3208.1395 3216.2517
redmass: 4.5354 3.3746 3.0223 2.4532 3.8135 3.6613 3.2244 3.2079 3.0784 2.5672 1.4748 3.6019 3.6750 3.5273 5.4004 3.3148 3.0398 3.5652 3.3246 2.8953 3.8066 3.5203 6.0455 3.7742 4.6508 1.5371 1.3269 1.3551 1.6294 1.7585 1.3040 1.5519 1.7759 3.1569 1.4832 2.7696 3.2580 3.2194 2.3737 1.3390 6.2086 2.9150 2.6773 1.2329 1.2014 1.2618 1.3030 1.1391 1.2039 1.2713 1.4922 1.2605 1.3332 1.4119 1.5784 1.4187 1.7359 2.9128 1.6129 1.6610 5.2278 1.3525 1.3025 1.2778 1.7737 5.7717 1.8209 3.9029 1.1710 1.0986 1.0872 1.0503 1.3687 1.3342 1.1186 2.1569 7.7761 6.4390 1.0334 1.0837 1.1036 1.0527 1.0529 1.0732 1.0612 1.0753 1.0987 1.0909 1.0871 1.0878 1.0956 1.0974 1.1164 1.1168 1.1143 1.1148
irintensity: 0.2274 1.1356 0.3565 0.1754 1.1137 1.5137 1.9442 1.8242 0.8754 4.1689 1.6249 3.1838 3.3219 0.3067 1.0045 3.4008 0.0218 1.1883 3.1525 8.4381 12.8897 5.3519 2.8299 4.1927 30.2747 2.6460 2.8376 19.2739 4.7163 0.5054 6.7521 67.6016 8.5643 17.2366 1.2853 4.9705 47.6721 1.3731 130.8250 0.7378 23.9173 43.5658 34.2233 33.6635 22.4274 7.2367 11.5258 2.6925 2.9954 14.4752 25.7899 0.1973 1.9616 1.5812 1.4786 5.2234 7.1956 436.0947 2.4262 3.9265 10.5051 9.5872 13.8264 9.0823 1.7072 8.9768 16.4914 3.6947 22.4991 11.5445 9.3459 12.9831 44.1378 6.3675 80.4349 235.3371 6.4955 2.5953 69.3833 31.6210 54.5412 21.2855 17.0907 19.1279 12.6555 15.6243 29.8355 7.0654 19.3089 5.0025 12.5365 3.2945 1.1644 1.2705 33.4769 25.2942
temp: 298.150 k
press: 1.00000 atm
elementType: 8 8 6 6 6 6 6 6 6 6 6 6 6 6 6 6 1 1 1 1 1 1 1 1 1 1 1 1 1 1 1 1 1 1
symmnumber: 1
zpe: 745887.8 jmol-1
zpe.correction: 0.284094 hartree
zpe.thermalcorrener: 0.299965 hartree
zpe.thermalcorrenthalpy: 0.300909 hartree
zpe.thermalcorrgfe: 0.239791 hartree
zpe.sumelectzpe: -693.433190 hartree
zpe.sumelectthermal: -693.417319 hartree
zpe.sumelectthermalent: -693.416375 hartree
zpe.sumelectthermalfe: -693.477493 hartree
dipole: -0.5736 0.6140 -2.7281
dipole: 2.8546
quadrupole: -85.3905 -98.0822 -90.5836
quadrupole: 2.0752 -6.5749 -3.6695
quadrupole: 5.9616 -6.7301 0.7685 2.0752 -6.5749 -3.6695
hfenergy: -693.7172837 hartree
pointgroup: C01 [X(C14H18O2)]
dipole: 0.2139257 0.3244896 1.0536722 debye
polarizability: 210.5588577|-12.5594178|126.9236247|3.0484923|10.3662446|131.8668204 unknown
InChI: InChI=1S/C14H18O2/c1-15-12-6-8-13(9-7-12)16-14(10-2-3-10)11-4-5-11/h6-11,14H,2-5H2,1H3
charge 0 multiplicity 1
34 atoms
O  1.02201 -0.365001 -0.748278
O  -4.563508 0.31699 -0.337617
C  2.991756 -1.371285 0.210117
C  2.626121 1.109417 0.454386
C  1.965034 -0.269277 0.400556
C  2.672415 -2.806093 0.636476
C  3.679538 -1.974203 1.447324
C  3.126969 1.786956 -0.828321
C  1.94485 2.388511 -0.050482
C  -0.353535 -0.147775 -0.530629
C  -0.911577 0.475399 0.609662
C  -1.207233 -0.592156 -1.574342
C  -2.314853 0.643521 0.713066
C  -2.596261 -0.417544 -1.47707
C  -3.15955 0.198585 -0.329484
C  -5.1856 0.957428 0.820265
H  3.610771 -1.242084 -0.684389
H  3.270192 1.217911 1.336483
H  1.401777 -0.46104 1.339393
H  3.052234 -3.623765 0.018084
H  1.690362 -2.998933 1.080001
H  3.368809 -1.61957 2.436144
H  4.741758 -2.224036 1.376342
H  2.886583 1.297881 -1.776926
H  4.091325 2.302596 -0.802456
H  2.105944 3.311814 0.513969
H  0.956686 2.298677 -0.507913
H  -0.273283 0.857959 1.411435
H  -0.758971 -1.074648 -2.448057
H  -2.72298 1.130479 1.603893
H  -3.266087 -0.755557 -2.273501
H  -4.980102 0.395939 1.753444
H  -6.265772 0.944957 0.612138
H  -4.841322 2.004345 0.937384
