program: Gaussian 09
title: 000143220
version: EM64L-G09RevD.01
frameworkgroup: C1[X(C16H30)]
method: RPBEPBE
basis: SDD
operation: Freq
keyword: #p
keyword: freq=noraman
keyword: PBEPBE/SDD
title: #p freq=noraman PBEPBE/SDD
converged: NO YES NO NO
title: Mulliken charges:
elementType: C C C C C C C C C C C C C C C C H H H H H H H H H H H H H H H H H H H H H H H H H H H H H H
charge: 0.003243 -0.006102 0.032365 -0.541723 -0.475310 -0.478839 -0.461364 -0.454698 -0.462870 -0.409693 -0.409570 -0.379482 -0.408474 -0.405277 -0.383992 -0.726261 0.202694 0.196065 0.201496 0.209022 0.195832 0.188671 0.210680 0.208337 0.193755 0.190981 0.208160 0.195251 0.188516 0.212765 0.205598 0.193900 0.188979 0.189221 0.193697 0.196617 0.186348 0.195010 0.189235 0.191005 0.194855 0.197078 0.187316 0.221345 0.211206 0.224411
chargesum: 0.00000
title: Mulliken charges with hydrogens summed into heavy atoms:
elementType: C C C C C C C C C C C C C C C C
charge: 0.205937 0.189963 0.233861 -0.136869 -0.075960 -0.076747 -0.062223 -0.070932 -0.044507 -0.026813 -0.026652 0.003483 -0.024228 -0.019416 0.000402 -0.069299
polarizability: 1.99565806e+02 3.39750742e-01 1.54879518e+02 -9.02105940e-01 1.28343071e+00 1.45046927e+02
1716.lowfreq: -11.9652 -0.0004 0.0002 0.0004 6.3048 14.0818 28.7665 42.9530 55.9889
frequency: 26.9150 42.5759 55.9748 77.2195 79.7630 124.6108 141.2477 180.0306 209.6985 213.1325 220.5128 250.0529 256.9081 308.5100 316.5323 336.3191 368.3340 412.8049 419.8622 425.9617 435.0397 452.4665 469.9026 537.1834 553.6556 571.1974 749.6393 773.0956 780.3185 782.1505 788.6941 799.4589 840.0965 843.8908 854.6189 884.7978 889.8557 892.6908 909.7862 917.3147 936.5207 949.3295 957.5087 984.4301 1013.6463 1031.6788 1050.4379 1053.9092 1057.2520 1058.6280 1067.9810 1072.7632 1092.8272 1106.9787 1114.6717 1116.3370 1130.3294 1140.2707 1151.4098 1175.2965 1193.8592 1202.8552 1218.7174 1248.7180 1256.4176 1257.2262 1260.3695 1263.9296 1269.9925 1272.6660 1284.0559 1299.2504 1308.5230 1315.7252 1320.7348 1327.9840 1332.3825 1335.5588 1337.5731 1337.9846 1338.2315 1339.6321 1342.3580 1349.5416 1352.1088 1358.1851 1366.8237 1387.6962 1455.8793 1458.2778 1459.6614 1460.6844 1461.5571 1462.2485 1464.9860 1468.2615 1468.8064 1475.3286 1475.5667 1482.6869 1483.3606 1495.1116 2925.1572 2936.9588 2939.5635 2948.2188 2948.8474 2953.2088 2957.4969 2958.8842 2960.3836 2961.0220 2961.5486 2961.8338 2962.9195 2963.6820 2977.1353 2991.1920 3009.7834 3016.1852 3019.9803 3021.2888 3022.1506 3023.0708 3024.7623 3025.5410 3030.8391 3033.8759 3037.6965 3041.3378 3068.4817 3071.6967
redmass: 2.7851 3.2538 2.8339 2.9214 2.6751 2.7785 2.8921 2.0210 1.6503 1.6700 1.8044 2.0510 2.9490 2.0747 1.7190 2.1140 2.8003 2.2978 2.2019 2.9697 2.7215 1.9587 1.9884 1.8606 2.2894 2.0349 1.7370 1.6456 1.4819 1.5035 1.9040 2.4284 1.7497 2.2483 1.9361 1.9052 1.4702 1.5386 1.8480 2.0268 1.7094 2.1825 2.2371 2.0521 1.5960 1.7021 1.6916 1.3983 1.4576 1.4973 1.3619 1.4128 1.9434 2.1294 2.5120 2.4470 1.7911 1.8662 2.0475 1.7069 1.6097 1.4669 1.4472 1.2513 1.2771 1.2754 1.2083 1.3224 1.2551 1.1804 1.2414 1.2714 1.3297 1.3783 1.2044 1.4374 1.3791 1.4203 1.4969 1.5264 1.4870 1.5403 1.4779 1.4553 1.3733 1.4905 1.4525 1.2173 1.0850 1.0869 1.0891 1.0879 1.0893 1.0894 1.0812 1.0805 1.0792 1.0942 1.0930 1.0493 1.0454 1.0848 1.0791 1.0791 1.0785 1.0617 1.0650 1.0630 1.0652 1.0682 1.0606 1.0596 1.0621 1.0603 1.0658 1.0663 1.0358 1.0627 1.0980 1.0967 1.0979 1.0961 1.0992 1.0957 1.1003 1.0996 1.0982 1.0977 1.1033 1.0984 1.0989 1.0999
irintensity: 0.0017 0.0001 0.0086 0.0133 0.0033 0.0325 0.0108 0.0079 0.0527 0.0201 0.1090 0.1351 0.0570 0.1271 0.1167 0.2628 0.1461 0.2792 0.1887 0.0372 0.0651 0.6045 0.9206 0.7786 1.5462 0.6028 10.3304 6.7777 0.0704 1.0050 2.4552 0.3383 6.0222 5.6670 1.8021 1.4316 11.5363 10.9616 0.5870 0.4017 4.2670 7.4433 6.5030 3.1547 4.9717 3.3783 0.5632 0.1062 0.2798 0.1646 0.0302 1.6236 0.1135 0.9327 0.0231 0.0469 0.5495 2.1309 4.0200 1.1403 0.1837 0.5405 1.2692 1.2500 1.5505 1.1048 4.5470 4.9648 1.2131 8.0911 2.7506 0.3062 0.5478 0.8567 0.5748 0.5256 1.0714 2.1900 0.9866 1.0336 1.0963 1.1899 0.1314 3.0376 0.3235 2.7776 0.0058 24.1601 2.5914 1.9211 6.6253 3.8810 6.0533 10.3198 3.7005 18.9466 27.0733 0.6640 1.4800 5.9569 1.8929 16.8537 0.6621 11.4722 2.9384 15.0854 8.4397 22.4918 71.1619 52.9970 33.1428 63.9902 25.7764 23.4759 44.7165 27.9347 39.3386 40.4789 14.5348 112.8830 34.3783 137.4084 99.1937 29.5745 0.9830 9.2812 25.0466 55.7711 184.7370 85.6677 50.6231 70.6912
temp: 298.150 k
press: 1.00000 atm
elementType: 6 6 6 6 6 6 6 6 6 6 6 6 6 6 6 6 1 1 1 1 1 1 1 1 1 1 1 1 1 1 1 1 1 1 1 1 1 1 1 1 1 1 1 1 1 1
symmnumber: 1
zpe: 1120071.2 jmol-1
zpe.correction: 0.426613 hartree
zpe.thermalcorrener: 0.443791 hartree
zpe.thermalcorrenthalpy: 0.444736 hartree
zpe.thermalcorrgfe: 0.381431 hartree
zpe.sumelectzpe: -626.391456 hartree
zpe.sumelectthermal: -626.374277 hartree
zpe.sumelectthermalent: -626.373333 hartree
zpe.sumelectthermalfe: -626.436638 hartree
dipole: 0.0280 0.0129 0.0469
dipole: 0.0561
quadrupole: -104.4799 -103.3801 -103.4202
quadrupole: 0.0219 0.0166 -0.2231
quadrupole: -0.7198 0.3799 0.3399 0.0219 0.0166 -0.2231
hfenergy: -626.8180687 hartree
pointgroup: C01 [X(C16H30)]
dipole: 0.0108842 0.0022574 0.019054 debye
polarizability: 199.5720955|0.5412404|154.2741057|-0.5207383|2.6943347|145.6460498 unknown
InChI: InChI=1S/C16H30/c1-2-15(16-11-7-4-8-12-16)13-14-9-5-3-6-10-14/h14-16H,2-13H2,1H3
charge 0 multiplicity 1
46 atoms
C  -0.510949 0.423482 0.340624
C  -1.960073 0.117708 -0.176395
C  2.050657 0.120984 -0.261363
C  0.568045 -0.144291 -0.63119
C  -2.211371 -1.408001 -0.346316
C  -3.053865 0.716141 0.752347
C  2.427904 -0.445093 1.133123
C  2.991236 -0.47456 -1.34325
C  -0.280646 1.936043 0.640802
C  -3.647963 -1.730109 -0.823978
C  -4.490597 0.393686 0.276015
C  -4.711907 -1.127075 0.119805
C  3.92112 -0.21699 1.470417
C  4.48534 -0.242029 -1.016281
C  4.847186 -0.804305 0.37913
C  -0.432615 2.879613 -0.574831
H  -0.406251 -0.111126 1.3118
H  -2.075533 0.585699 -1.180553
H  2.228744 1.218534 -0.241767
H  0.441534 -1.242704 -0.70733
H  0.380864 0.257027 -1.650293
H  -2.029499 -1.908644 0.629508
H  -1.49143 -1.840691 -1.065191
H  -2.939264 1.813881 0.824649
H  -2.909863 0.311715 1.777884
H  2.210487 -1.535073 1.144025
H  1.79499 0.011874 1.918517
H  2.745043 -0.038768 -2.33271
H  2.801124 -1.56681 -1.420923
H  -0.974645 2.260531 1.439412
H  0.733668 2.062777 1.066778
H  -3.779688 -2.827134 -0.904736
H  -3.793056 -1.315395 -1.843818
H  -4.668114 0.886694 -0.703006
H  -5.226424 0.820779 0.985633
H  -5.730681 -1.332905 -0.263103
H  -4.636928 -1.613259 1.11496
H  4.16041 -0.662358 2.456138
H  4.111236 0.873345 1.557962
H  4.699085 0.84719 -1.035562
H  5.122759 -0.706323 -1.794258
H  5.907212 -0.589387 0.618071
H  4.738549 -1.908963 0.365264
H  -1.453945 2.840785 -0.996104
H  -0.231782 3.927525 -0.284469
H  0.272896 2.61738 -1.384438
