program: Gaussian 09
title: 000143210
version: EM64L-G09RevD.01
frameworkgroup: C1[X(C14H26)]
method: RPBEPBE
basis: SDD
operation: Freq
keyword: #p
keyword: freq=noraman
keyword: PBEPBE/SDD
title: #p freq=noraman PBEPBE/SDD
converged: NO YES NO NO
title: Mulliken charges:
elementType: C C C C C C C C C C C C C C H H H H H H H H H H H H H H H H H H H H H H H H H H
charge: 0.016517 0.053971 -0.534858 -0.067741 -0.464760 -0.440827 -0.464882 -0.456642 -0.404050 -0.399767 -0.405952 -0.404431 -0.383260 -0.773746 0.197436 0.197051 0.196617 0.192571 0.200483 0.195446 0.194611 0.192770 0.193164 0.190115 0.205755 0.195619 0.189482 0.189486 0.196728 0.201224 0.194722 0.195174 0.189281 0.190795 0.194850 0.197400 0.187146 0.211140 0.224164 0.217198
chargesum: 0.00000
title: Mulliken charges with hydrogens summed into heavy atoms:
elementType: C C C C C C C C C C C C C C
charge: 0.213953 0.251022 -0.145670 0.132741 -0.074703 -0.054892 -0.069012 -0.071541 -0.017836 -0.003822 -0.021497 -0.018787 0.001285 -0.121244
polarizability: 1.70225512e+02 9.61220588e-01 1.31758028e+02 -2.17702949e+00 8.79257226e-02 1.30013973e+02
1716.lowfreq: -11.2459 -0.0002 0.0003 0.0009 16.7907 30.0447 54.9982 61.5767 74.5337
frequency: 54.0389 60.9906 74.2483 137.1337 147.7366 157.4976 204.2307 225.3437 246.3419 270.6575 282.1476 305.9024 324.3063 372.6291 408.4290 433.4781 441.0204 459.7891 467.4808 533.1676 558.0165 593.8418 719.7613 771.8394 783.5127 798.1462 827.3703 841.2584 843.9908 853.7543 890.7707 894.7328 911.7208 916.2634 941.4916 961.5005 975.0331 981.2413 1011.7806 1043.7539 1052.1482 1057.5952 1065.6149 1072.3466 1085.5439 1103.8816 1107.3362 1114.6373 1121.1161 1144.5288 1157.3612 1177.3026 1195.2905 1218.3673 1240.9382 1247.0474 1254.0235 1258.2051 1265.6037 1276.5775 1295.3733 1298.3261 1309.4115 1321.3753 1330.3129 1333.1296 1334.1639 1336.7430 1338.9992 1340.6678 1342.0299 1351.3093 1357.8615 1359.9799 1360.9855 1390.2117 1455.2461 1457.1967 1460.1207 1461.4178 1462.4868 1463.3333 1467.0216 1469.2458 1474.9765 1479.1237 1482.6502 1490.6990 2934.1894 2936.1693 2943.7305 2948.7724 2949.8429 2956.8047 2958.8460 2961.7803 2962.3817 2962.9347 2964.0407 2966.7031 2973.2633 2979.3216 2996.1859 3011.3757 3014.4047 3016.9561 3020.6941 3022.5956 3022.9751 3025.0231 3036.9453 3037.6853 3064.4023 3074.6778
redmass: 2.9093 3.0628 3.1567 2.8602 2.5390 1.3134 1.7272 1.8997 3.2025 2.3281 2.2838 2.1580 1.6985 1.8334 2.3836 2.9675 1.9301 2.2171 2.7981 2.2878 1.9156 1.9739 2.6658 2.2424 1.5460 1.5865 2.0058 1.6461 2.2072 2.0065 1.6216 1.6571 1.9303 1.8525 1.5491 2.3124 1.6471 1.6883 1.8043 1.8480 1.6063 1.1617 1.3620 1.5544 1.9106 1.2777 2.4376 1.8100 2.5167 1.7490 1.9875 1.6532 1.5858 1.5856 1.3082 1.2771 1.2385 1.2656 1.3269 1.2159 1.3183 1.2691 1.3012 1.4412 1.3928 1.4392 1.3719 1.4549 1.5369 1.5283 1.4694 1.4740 1.5028 1.4821 1.4235 1.2298 1.0838 1.0862 1.0839 1.0852 1.0891 1.0799 1.0816 1.0845 1.0935 1.0814 1.0665 1.0592 1.0788 1.0805 1.0600 1.0671 1.0639 1.0631 1.0605 1.0600 1.0615 1.0630 1.0674 1.0722 1.0596 1.0433 1.0998 1.0979 1.0984 1.0976 1.0992 1.0959 1.0981 1.1019 1.1034 1.1036 1.0986 1.0986
irintensity: 0.0016 0.0023 0.0159 0.0075 0.0380 0.1014 0.0031 0.0339 0.0669 0.0434 0.4530 0.0442 0.0307 0.2411 0.0889 0.0878 1.3079 0.2964 0.3202 1.2265 0.2175 3.0975 1.6696 0.0190 0.0158 0.8235 0.9116 1.9549 8.3190 7.4372 9.8197 1.9915 0.9765 0.0917 4.7677 3.2063 11.8141 10.4050 1.0674 0.3383 0.7129 1.6352 0.8737 1.5255 0.0162 0.3787 1.1945 0.3462 0.5208 4.1826 4.3182 0.6058 2.0231 0.4104 2.7268 1.8264 0.7359 1.0347 3.5792 3.3281 1.1972 0.1736 1.0044 0.6943 0.6820 0.2171 0.0549 0.1477 0.4718 0.8370 0.2110 0.8590 0.2822 0.4251 1.1938 24.2457 1.3222 3.2064 0.4328 7.3047 9.2860 9.7064 18.2662 21.3291 4.8675 6.2042 9.0647 2.6720 8.5864 6.8340 8.8927 33.3699 10.8374 61.6099 33.2239 40.5503 26.4186 51.5980 34.0841 94.9316 24.4068 24.2608 12.7414 63.6925 125.3378 27.6452 70.2548 100.3136 14.1865 10.3397 92.9557 178.0398 41.0881 48.3044
temp: 298.150 k
press: 1.00000 atm
elementType: 6 6 6 6 6 6 6 6 6 6 6 6 6 6 1 1 1 1 1 1 1 1 1 1 1 1 1 1 1 1 1 1 1 1 1 1 1 1 1 1
symmnumber: 1
zpe: 973215.4 jmol-1
zpe.correction: 0.370678 hartree
zpe.thermalcorrener: 0.385095 hartree
zpe.thermalcorrenthalpy: 0.386039 hartree
zpe.thermalcorrgfe: 0.330094 hartree
zpe.sumelectzpe: -547.948620 hartree
zpe.sumelectthermal: -547.934203 hartree
zpe.sumelectthermalent: -547.933259 hartree
zpe.sumelectthermalfe: -547.989204 hartree
dipole: -0.0534 0.1094 -0.0414
dipole: 0.1286
quadrupole: -91.3004 -90.6633 -89.9744
quadrupole: 0.0437 0.2254 0.1062
quadrupole: -0.6543 -0.0173 0.6716 0.0437 0.2254 0.1062
hfenergy: -548.319298 hartree
pointgroup: C01 [X(C14H26)]
dipole: -0.0206464 -0.0423746 0.0183471 debye
polarizability: 170.2753664|-0.7157564|131.7561066|1.7760004|0.0299439|129.9660403 unknown
InChI: InChI=1S/C14H26/c1-12-7-5-6-10-14(12)11-13-8-3-2-4-9-13/h12-14H,2-11H2,1H3
charge 0 multiplicity 1
40 atoms
C  1.168051 0.239258 0.46513
C  -1.411574 0.302811 -0.095756
C  -0.132104 1.074149 0.318659
C  1.545181 -0.591278 -0.804865
C  2.344315 1.149358 0.912384
C  2.852789 -1.390525 -0.5329
C  -1.803263 -0.797466 0.925886
C  -2.597176 1.284667 -0.293742
C  3.648147 0.350862 1.147653
C  4.029188 -0.484047 -0.097427
C  -3.106704 -1.528787 0.523311
C  -3.90159 0.5600 -0.701601
C  -4.27625 -0.536288 0.324174
C  1.652613 0.257431 -2.096925
H  1.010958 -0.499279 1.283161
H  -1.227194 -0.195823 -1.073406
H  0.043018 1.889967 -0.414589
H  -0.328579 1.578043 1.290033
H  0.737429 -1.335158 -0.972607
H  2.057047 1.686005 1.839187
H  2.521903 1.930971 0.144517
H  3.130125 -1.970009 -1.436348
H  2.658887 -2.128851 0.273753
H  -1.941108 -0.323524 1.921777
H  -0.98276 -1.533141 1.034883
H  -2.328775 2.044365 -1.055414
H  -2.767463 1.8340 0.657129
H  3.504499 -0.332816 2.010639
H  4.474129 1.037638 1.418424
H  4.306848 0.196307 -0.927327
H  4.922987 -1.102557 0.115783
H  -3.370912 -2.283921 1.289491
H  -2.935596 -2.080706 -0.424618
H  -3.762515 0.091439 -1.698378
H  -4.728463 1.290042 -0.803732
H  -5.186665 -1.075424 -0.003439
H  -4.517731 -0.057783 1.296374
H  1.962668 -0.378572 -2.947573
H  0.683534 0.717525 -2.361913
H  2.393605 1.071814 -2.004484
