program: Gaussian 09
title: 000143172
version: EM64L-G09RevD.01
frameworkgroup: C1[X(C5H10Br2)]
method: RPBEPBE
basis: SDD
operation: Freq
keyword: #pfreq=noraman
keyword: PBEPBE/SDD
title: #p freq=noraman PBEPBE/SDD
converged: YES YES NO NO
title: Mulliken charges:
elementType: Br Br C C C C C H H H H H H H H H H
charge: -0.031580 -0.030348 -0.028924 -0.287094 -0.699880 -0.703196 -0.706142 0.236199 0.217643 0.248821 0.281866 0.274324 0.223152 0.217148 0.225981 0.281851 0.280179
chargesum: 0.00000
title: Mulliken charges with hydrogens summed into heavy atoms:
elementType: Br Br C C C C C
charge: -0.031580 -0.030348 0.207275 0.179370 -0.143689 -0.036915 -0.144112
polarizability: 1.00411803e+02 2.72901219e+00 9.23941059e+01 -5.24040829e+00 4.36774141e-01 5.66750656e+01
1716.lowfreq: -12.3321 -0.8887 -0.0004 -0.0003 -0.0003 4.3484 44.6097 58.6131 96.3634
frequency: 44.5851 58.5154 96.3586 128.1936 168.3659 211.0215 225.1966 306.3429 399.5550 413.7447 614.5233 629.3341 759.9775 812.6448 869.8749 920.5488 935.2012 1037.0843 1052.4038 1058.6236 1114.8780 1146.8842 1199.8164 1234.0808 1236.1241 1280.2009 1305.4980 1322.8008 1348.5921 1387.7968 1440.8048 1450.0350 1468.6459 1476.5834 1482.0909 2979.0809 2989.3258 3000.1504 3043.9656 3050.3969 3063.4938 3074.9271 3081.9910 3129.8333 3136.0074
redmass: 7.6526 2.2673 3.2315 2.5257 2.4657 1.3963 4.6145 3.1687 3.1056 2.1231 4.7033 4.6315 1.1826 1.9918 1.5979 1.2980 1.7589 1.2739 1.6598 3.6312 1.4852 1.8071 1.5325 1.1893 1.1655 1.1976 1.2544 1.2860 1.4569 1.1945 1.1018 1.1016 1.0807 1.0600 1.0493 1.0359 1.0756 1.0694 1.0568 1.0568 1.1010 1.1000 1.0985 1.1105 1.1106
irintensity: 0.9369 0.7557 0.8583 1.0957 1.4577 0.9313 5.0271 2.0632 0.6055 1.4703 38.0304 30.5168 7.9636 3.5112 14.2616 3.3434 22.0591 3.5254 5.2001 2.8733 4.5858 1.3022 6.1463 21.2268 29.9832 3.8385 20.9493 9.6532 11.7660 19.0601 5.2592 4.0173 3.0713 4.4740 26.0935 26.4241 0.5284 20.8597 18.1712 18.0935 8.8107 37.0541 38.6242 12.5977 13.4521
temp: 298.150 k
press: 1.00000 atm
elementType: 35 35 6 6 6 6 6 1 1 1 1 1 1 1 1 1 1
symmnumber: 1
zpe: 365974.1 jmol-1
zpe.correction: 0.139392 hartree
zpe.thermalcorrener: 0.148888 hartree
zpe.thermalcorrenthalpy: 0.149833 hartree
zpe.thermalcorrgfe: 0.101304 hartree
zpe.sumelectzpe: -222.869466 hartree
zpe.sumelectthermal: -222.859970 hartree
zpe.sumelectthermalent: -222.859025 hartree
zpe.sumelectthermalfe: -222.907554 hartree
dipole: 1.0269 3.5803 -0.1455
dipole: 3.7275
quadrupole: -74.7946 -59.7474 -61.8361
quadrupole: 2.5024 1.5568 0.0549
quadrupole: -9.3352 5.7119 3.6233 2.5024 1.5568 0.0549
hfenergy: -223.0088579 hartree
pointgroup: C01 [X(C5H10Br2)]
dipole: -0.5347026 1.3655641 0.0011351 debye
dipolederiv: -0.2494201 -0.1286466 0.0053485 -0.2230952 -0.5000586 0.0492819 0.0534892 0.1024842 -0.1684382 -0.5531937 0.116033 0.0281791 0.2196695 -0.2171724 -0.0260605 0.1026519 -0.0444746 -0.1678219 0.0892947 0.0500017 -0.0337537 -0.240599 -0.0580312 0.0246375 -0.104684 0.1381075 0.1028523 -0.2033674 0.0288168 -0.0244877 0.1105897 -0.0786953 -0.0407154 0.1085902 -0.1058855 0.0906274 0.1587233 0.238662 -0.0489458 0.4196263 0.7036899 -0.1697593 -0.0289926 -0.1669856 0.1697299 -0.0835824 -0.1513471 0.0123082 0.0035792 -0.0483257 0.0183435 -0.0431487 -0.094648 0.1035835 0.7071329 -0.2616572 -0.1201784 -0.3039087 0.2738338 0.0585439 -0.1283825 0.0725369 0.1616801 0.0556037 -0.0161302 -0.0081493 0.0241827 0.0468482 0.0338995 0.0147179 0.0069212 -0.1413193 0.0441469 0.0138448 -0.0066962 -0.0209497 0.0762065 0.0447385 -0.0106362 0.0281696 -0.1352583 0.1178959 -0.0040264 -0.002034 -0.0047946 -0.0861627 0.003517 -0.0266037 0.022512 0.073438 -0.0850653 0.0293577 0.0286728 0.0561968 -0.1015819 0.0178681 0.0297604 0.0218005 0.0753937 0.0796885 -0.0438072 0.0568384 -0.0614394 -0.0292698 0.0655346 -0.0148138 0.0238035 -0.1025726 -0.0910545 0.1535736 0.0698503 0.1054638 0.020939 -0.0233807 0.0701998 -0.0309963 0.0694993 0.1044325 0.0043878 0.0157052 0.0028945 0.0757831 -0.0204254 0.0117251 0.0672064 -0.1495062 -0.0628377 -0.1280866 -0.0853841 -0.1356312 0.003415 -0.0049088 -0.0798895 -0.0244829 0.0517042 -0.011475 0.0473566 0.0264027 -0.0063203 -0.1329086 -0.0175032 0.028668 -0.0067207 0.0709739 -0.0169223 0.0516674 0.0863239 0.0545356 0.0514909 -0.0136111 0.0173486 -0.0093482 -0.1045659 unknown
polarizability: 100.1871267|-2.4137218|91.7061003|-7.3583935|-2.9751023|57.5877471 unknown
InChI: InChI=1S/C5H10Br2/c1-5(4-7)2-3-6/h5H,2-4H2,1H3
charge 0 multiplicity 1
17 atoms
Br -2.45043 -1.834776 0.33029
Br 3.399225 -0.926147 -0.183615
C  -0.696965 0.586331 0.256237
C  0.539449 -0.206366 -0.25819
C  -2.001218 0.035162 -0.343875
C  -0.61296 2.098637 -0.093082
C  1.824605 0.183298 0.475557
H  -0.757252 0.483198 1.358486
H  0.661161 -0.030831 -1.344992
H  0.35782 -1.287248 -0.118592
H  -2.875808 0.637103 -0.052507
H  -1.952237 -0.067669 -1.440262
H  -1.502758 2.644456 0.270249
H  -0.538741 2.249939 -1.18663
H  0.272951 2.565077 0.372704
H  2.138387 1.222615 0.297782
H  1.773471 -0.023979 1.556139
