program: Gaussian 09
title: 000143166
version: EM64L-G09RevD.01
frameworkgroup: C1[X(C10H12)]
method: RPBEPBE
basis: SDD
operation: Freq
keyword: #p
keyword: freq=noraman
keyword: PBEPBE/SDD
title: #p freq=noraman PBEPBE/SDD
converged: YES YES NO NO
title: Mulliken charges:
elementType: C C C C C C C C C C H H H H H H H H H H H H
charge: 0.261002 0.260917 -0.481742 -0.481737 -0.339548 -0.355158 -0.355049 -0.339481 -0.398103 -0.398124 0.199641 0.203823 0.199650 0.203800 0.255126 0.255308 0.255311 0.255140 0.204146 0.195466 0.204150 0.195462
chargesum: 0.00000
title: Mulliken charges with hydrogens summed into heavy atoms:
elementType: C C C C C C C C C C
charge: 0.261002 0.260917 -0.078277 -0.078288 -0.084422 -0.099850 -0.099738 -0.084341 0.001509 0.001488
polarizability: 1.04780301e+02 1.12600671e-03 9.38685692e+01 -4.78992153e-03 5.52650546e+00 9.00905726e+01
1716.lowfreq: 0.0007 0.0008 0.0008 9.5926 12.6236 16.6525 85.7481 131.9343 213.6925
frequency: 85.6983 131.9006 213.6883 228.9809 269.4808 347.6268 352.6972 367.9542 428.2467 449.1331 494.7714 544.7389 578.7442 613.4714 628.2672 763.7681 768.1441 806.0303 824.6584 826.3561 839.6875 847.7416 914.3529 924.7554 936.8028 959.2235 1000.4574 1002.2686 1068.6767 1071.0320 1076.5995 1127.3631 1129.4920 1193.5840 1221.0417 1234.5310 1280.6522 1292.8834 1317.9010 1321.6813 1336.4297 1343.5555 1457.1071 1459.0879 1465.9723 1472.7228 1620.9262 1626.7643 2954.0091 2954.5217 2966.3003 2968.7783 3024.0454 3027.0156 3033.7582 3039.5672 3204.5602 3204.7067 3254.8603 3255.4252
redmass: 3.2171 2.7106 2.6370 3.2573 2.2774 2.6063 1.8597 2.8827 3.4006 2.0280 2.6903 1.6855 1.8535 1.5946 1.9376 2.8746 2.2921 1.9524 1.4464 1.4464 2.0031 2.4032 1.4878 1.1558 1.5542 2.1140 1.5460 1.5591 2.2537 2.0106 1.5075 2.4514 1.4073 3.0586 1.9009 1.5226 1.6222 2.5569 1.6937 1.3876 1.4247 1.5796 1.0859 1.0904 1.0825 1.0942 5.3942 5.3478 1.0645 1.0645 1.0588 1.0643 1.0978 1.0972 1.0975 1.1031 1.0854 1.0853 1.1447 1.1443
irintensity: 0.0757 0.3142 0.7647 0.2585 0.0178 3.0790 0.4188 1.4498 0.0849 15.8471 2.1258 23.8143 34.9034 128.2943 22.7400 2.1871 1.0981 10.1627 0.2063 0.2403 3.5185 6.4797 4.9580 4.7179 12.4235 8.1425 10.4569 31.7249 10.2172 0.0025 1.3171 2.9200 5.1749 7.6451 3.6075 2.5133 3.2523 1.0141 1.1419 0.0813 0.0279 0.0404 1.4080 16.4473 10.7047 6.3126 22.3441 17.2909 64.6674 0.2523 34.2573 40.6647 67.6457 74.9470 0.9921 94.8606 0.1552 0.1390 1.6267 1.2805
temp: 298.150 k
press: 1.00000 atm
elementType: 6 6 6 6 6 6 6 6 6 6 1 1 1 1 1 1 1 1 1 1 1 1
symmnumber: 1
zpe: 479434.6 jmol-1
zpe.correction: 0.182607 hartree
zpe.thermalcorrener: 0.191957 hartree
zpe.thermalcorrenthalpy: 0.192901 hartree
zpe.thermalcorrgfe: 0.149067 hartree
zpe.sumelectzpe: -387.328288 hartree
zpe.sumelectthermal: -387.318938 hartree
zpe.sumelectthermalent: -387.317994 hartree
zpe.sumelectthermalfe: -387.361828 hartree
dipole: 0.1444 0.0002 -0.0003
dipole: 0.1444
quadrupole: -58.7508 -60.5987 -56.6442
quadrupole: -0.0046 -0.0069 1.3517
quadrupole: -0.0862 -1.9341 2.0203 -0.0046 -0.0069 1.3517
hfenergy: -387.5108951 hartree
pointgroup: C01 [X(C10H12)]
dipole: -0.056799 -0.0000769 0.000221 debye
dipolederiv: 0.1415397 0.0263912 -0.2127448 -0.0229472 0.2524629 -0.0068233 -0.2668797 0.0163572 0.028057 0.1420774 -0.0263644 0.2122752 0.0226537 0.2512531 -0.0056725 0.2661847 0.0180901 0.0256445 -0.0114941 -0.0307111 0.0483366 -0.0179944 -0.0092772 -0.0126412 0.0446935 -0.016763 0.1707928 -0.0118394 0.03068 -0.0476155 0.018001 -0.0089866 -0.0128935 -0.0438793 -0.0171131 0.1712076 -0.0630558 0.2400778 -0.0670801 0.1189572 -0.2490472 -0.0867748 0.1833113 0.0763326 -0.1417172 -0.2110557 -0.000142 0.1047241 0.1213741 -0.2229537 -0.0334838 -0.1441163 -0.2452086 -0.065523 -0.2100554 -0.0005401 -0.1043175 -0.1215418 -0.2231841 -0.0334464 0.1459031 -0.2446711 -0.0650955 -0.061266 -0.2391378 0.0672789 -0.1183664 -0.2501137 -0.0863514 -0.1841321 0.0760773 -0.1407751 0.0840811 -0.0203936 -0.0088842 -0.0023186 0.0731303 -0.0344753 0.0215628 -0.0248952 0.1201547 0.0838861 0.020346 0.0091515 0.0022542 0.0732196 -0.0344761 -0.0213118 -0.0250879 0.1201847 -0.0073647 -0.0122159 -0.009416 -0.0053857 0.0673725 0.1044137 0.0294253 0.0525857 -0.1651636 0.0250536 -0.0231999 -0.0130194 0.0153392 -0.2116182 -0.0474609 -0.007324 -0.0081194 0.0655837 -0.0075422 0.0120341 0.008369 0.0054035 0.0674334 0.1044834 -0.030247 0.0524218 -0.1650916 0.0250599 0.024275 0.0133699 -0.0143943 -0.2116254 -0.0473931 0.0074803 -0.0082144 0.0655127 0.1410852 -0.0818433 0.041089 -0.0584231 0.1409885 0.098407 0.0177917 0.1011378 0.007408 0.0125676 -0.1130286 -0.0759299 -0.1100793 0.1628263 -0.0047942 -0.0482827 0.0167647 0.1153722 0.0120773 0.112304 0.0761607 0.1092299 0.1638607 -0.004726 0.0487079 0.0164938 0.1148122 0.1402928 0.0818665 -0.0415614 0.0586677 0.1416695 0.0978901 -0.0186397 0.1008356 0.0074996 -0.1844901 0.0804369 0.0940897 0.0740406 0.0006651 -0.0428396 0.1199888 -0.0681666 0.0206578 0.0724383 -0.0278064 0.0035702 -0.0063098 -0.0040856 0.0660418 -0.062673 0.0996809 -0.1553368 -0.1844591 -0.0815168 -0.0932225 -0.0750336 -0.0000421 -0.0430095 -0.1190045 -0.0684461 0.0213466 0.0724634 0.0284884 -0.0046237 0.0068731 -0.0039481 0.0660258 0.0614409 0.0999079 -0.1555313 unknown
polarizability: 104.7802236|0.0186932|93.6523537|-0.0141133|-5.5957992|90.3068653 unknown
InChI: InChI=1S/C10H12/c1-2-4-10(7-8-10)9(3-1)5-6-9/h5-8H,1-4H2
charge 0 multiplicity 1
22 atoms
C  -0.348024 -0.764768 -0.070856
C  -0.351316 0.762474 0.071723
C  0.92832 -1.287429 -0.754832
C  0.924766 1.291018 0.751622
C  -1.082933 -1.626606 0.985004
C  -1.683303 -1.524036 -0.200057
C  -1.689774 1.515551 0.205059
C  -1.093559 1.620711 -0.98185
C  2.206342 -0.767402 -0.049151
C  2.202907 0.777088 0.041648
H  0.936037 -0.940979 -1.810655
H  0.918704 -2.3938 -0.77499
H  0.937679 0.944454 1.807358
H  0.910049 2.397351 0.772006
H  -1.091788 -2.014703 2.00056
H  -2.524497 -1.779067 -0.839118
H  -2.529282 1.765927 0.848136
H  -1.105483 2.007979 -1.997673
H  3.108273 -1.117224 -0.588827
H  2.25687 -1.193447 0.974164
H  3.10495 1.131065 0.578408
H  2.24806 1.203442 -0.981781
