program: Gaussian 09
title: 000143114
version: EM64L-G09RevD.01
frameworkgroup: C1[X(C5H10S)]
method: RPBEPBE
basis: SDD
operation: Freq
keyword: #pfreq=noraman
keyword: PBEPBE/SDD
title: #p freq=noraman PBEPBE/SDD
converged: YES YES NO NO
title: Mulliken charges:
elementType: S C C C C C H H H H H H H H H H
charge: 0.023715 0.056010 -0.373635 -0.670357 -0.673360 -0.640362 0.268800 0.226488 0.207015 0.232063 0.208702 0.228375 0.236336 0.231259 0.226433 0.212516
chargesum: 0.00000
title: Mulliken charges with hydrogens summed into heavy atoms:
elementType: S C C C C C
charge: 0.023715 0.056010 -0.104835 -0.004791 0.000054 0.029846
polarizability: 7.29718912e+01 -3.30751413e+00 7.45895355e+01 -2.00040611e+00 -5.83846592e+00 6.07424864e+01
1716.lowfreq: -15.9425 -0.0041 -0.0033 -0.0031 4.7207 23.1008 169.9896 183.8136 198.9162
frequency: 169.9822 183.7834 198.9028 231.1664 268.9751 300.1305 323.5915 376.6850 471.3177 507.5882 550.8065 729.1991 941.1803 943.8750 963.2080 988.6233 1043.6247 1068.7388 1090.8569 1126.0114 1226.1107 1303.7318 1374.9210 1383.9574 1393.0987 1400.8564 1446.8040 1455.8979 1462.4410 1475.4963 1476.0506 1490.4192 2966.5144 2971.9863 2975.5736 3061.5435 3066.1270 3068.3157 3086.9246 3097.5969 3107.0289 3114.0050
redmass: 1.2025 1.3347 1.5784 1.2263 1.7209 3.3450 3.1961 2.3639 2.9070 3.4413 5.7620 3.0122 1.3867 1.8991 1.1214 1.2600 1.4333 1.6160 1.6246 2.3078 2.3652 2.0565 1.7936 1.3395 1.3098 1.2058 1.0512 1.0440 1.0469 1.0629 1.1046 1.0541 1.0405 1.0412 1.0408 1.0933 1.0932 1.0935 1.0908 1.1001 1.0977 1.0973
irintensity: 0.3637 0.2924 0.8384 0.1365 0.4288 3.1604 2.6826 0.1455 2.9671 9.9277 12.9524 1.5179 1.0526 1.4397 6.6549 1.5457 20.9933 5.6615 37.4411 4.3339 6.7190 2.2348 7.1782 19.8698 15.4666 5.0077 2.4822 18.7941 6.3846 12.8951 2.0101 24.6982 20.9536 35.4738 41.3709 8.6902 15.8776 34.2096 5.0241 13.0155 35.8950 27.2309
temp: 298.150 k
press: 1.00000 atm
elementType: 16 6 6 6 6 6 1 1 1 1 1 1 1 1 1 1
symmnumber: 1
zpe: 358183.8 jmol-1
zpe.correction: 0.136425 hartree
zpe.thermalcorrener: 0.144261 hartree
zpe.thermalcorrenthalpy: 0.145205 hartree
zpe.thermalcorrgfe: 0.105105 hartree
zpe.sumelectzpe: -594.080578 hartree
zpe.sumelectthermal: -594.072742 hartree
zpe.sumelectthermalent: -594.071797 hartree
zpe.sumelectthermalfe: -594.111897 hartree
dipole: 0.4197 -2.4758 1.0410
dipole: 2.7184
quadrupole: -43.1194 -48.1987 -44.8908
quadrupole: 0.5723 -1.1268 0.9191
quadrupole: 2.2835 -2.7957 0.5122 0.5723 -1.1268 0.9191
hfenergy: -594.2170025 hartree
pointgroup: C01 [X(C5H10S1)]
dipole: -0.0868632 0.7105518 0.7945873 debye
dipolederiv: -0.323953 0.0223569 0.0563642 0.039034 -0.4528832 -0.2266419 0.0467325 -0.2640223 -0.4751652 0.165318 -0.004068 -0.0664481 -0.1786983 0.3531862 0.0754408 -0.2814616 0.1972945 0.3115957 0.1217695 0.0339767 -0.0016382 0.1972729 0.1631872 0.1610467 0.1882743 0.0830087 0.2226432 0.0063523 -0.0001711 0.0424678 -0.0071282 -0.0859123 0.0788598 0.0749009 0.0002565 -0.0002147 -0.0097696 -0.053879 0.0397208 0.0242439 -0.0469483 0.0141379 0.0926305 0.0413221 0.0034914 -0.0585188 -0.0805678 0.0190786 -0.0936086 -0.0002631 0.0051222 -0.0682393 -0.0333327 -0.0040556 0.0509825 -0.0485241 0.0017677 -0.0581838 -0.0128322 0.0608107 -0.0327355 0.0669382 -0.0914075 -0.077136 0.0461759 -0.1167536 -0.0049939 0.0721211 -0.0174361 -0.1136056 0.0348441 0.0387719 0.0945097 0.0349778 0.0118676 0.0639338 -0.0877896 -0.094858 0.0223206 -0.1241871 -0.0514891 -0.0375526 -0.0829063 0.1125079 -0.0433364 0.0625991 0.0174004 0.0937112 0.0458168 0.0465694 0.0185256 0.0192851 0.0560827 0.0286786 0.002656 -0.1293123 0.1004945 -0.1194273 -0.0769578 -0.0882324 0.0080886 -0.0604353 0.0024796 0.1057142 0.019805 -0.1330732 -0.0000134 0.0068075 0.0835123 0.0623224 -0.0194908 0.0005434 -0.0875239 0.0947178 0.0020089 0.0696605 0.059357 -0.0936554 0.0692182 -0.0263246 0.1281053 0.0108306 0.0010776 0.0070763 0.0016934 0.1111664 0.1126788 0.0067942 -0.0303768 -0.0256842 0.0061443 0.0850547 0.0290147 0.1215555 -0.0369139 0.0351691 -0.0330797 -0.01839 -0.0726581 -0.0022861 -0.1452254 -0.0280491 -0.1214074 -0.0641987 unknown
polarizability: 72.6492548|-3.608186|67.8915461|0.5765448|9.2326819|67.7631122 unknown
InChI: InChI=1S/C5H10S/c1-4-5(2,3)6-4/h4H,1-3H3
charge 0 multiplicity 1
16 atoms
S  0.22694 -1.237388 -1.204244
C  -0.559733 0.087498 0.009932
C  0.79046 -0.414899 0.455709
C  -0.710264 1.487807 -0.571357
C  -1.783473 -0.422573 0.764098
C  2.053795 0.426772 0.432644
H  0.754308 -1.147298 1.274442
H  -1.61048 1.541868 -1.208685
H  -0.82936 2.227042 0.246801
H  0.156144 1.780775 -1.184566
H  -1.999895 0.238193 1.628273
H  -2.673966 -0.429813 0.110877
H  -1.626007 -1.448557 1.137335
H  2.94688 -0.222507 0.424648
H  2.100413 1.075145 -0.45719
H  2.106337 1.066634 1.336483
