program: Gaussian 09
title: 000143090
version: EM64L-G09RevD.01
frameworkgroup: C1[X(C9H20N2)]
method: RPBEPBE
basis: SDD
operation: Freq
keyword: #pfreq=noraman
keyword: PBEPBE/SDD
title: #p freq=noraman PBEPBE/SDD
converged: YES YES NO NO
title: Mulliken charges:
elementType: N N C C C C C C C C C H H H H H H H H H H H H H H H H H H H H
charge: -0.080583 -0.067325 0.416549 -0.474842 -0.501130 -0.429180 -0.477282 -0.725122 -0.726469 -0.606806 -0.617332 0.234514 0.186793 0.228571 0.203229 0.233383 0.198867 0.201202 0.212114 0.210234 0.220174 0.217584 0.225706 0.223030 0.216065 0.203668 0.213444 0.219375 0.201789 0.219611 0.220169
chargesum: 0.00000
title: Mulliken charges with hydrogens summed into heavy atoms:
elementType: N N C C C C C C C C C
charge: -0.080583 -0.067325 0.416549 -0.053535 -0.069331 0.003070 -0.063966 -0.077130 -0.061667 0.029681 0.024237
polarizability: 1.22970561e+02 -5.73497423e-01 1.11696106e+02 1.32352676e+00 2.07778477e+00 9.48744014e+01
1716.lowfreq: -0.0008 -0.0005 -0.0004 12.0935 19.8398 26.8978 44.5892 90.4726 92.9426
frequency: 44.4047 90.4457 92.8327 129.5148 182.6830 198.0608 218.3526 224.5379 242.5187 276.2404 292.3395 300.3705 327.9209 343.1617 369.4392 416.4596 456.9392 504.9793 580.1393 586.1803 682.4224 741.3255 767.5848 798.0753 892.2213 908.9830 934.1399 941.7399 983.1383 990.2674 1014.9384 1042.3761 1052.7444 1070.5870 1074.7522 1088.2583 1106.3053 1123.7319 1158.0226 1173.3957 1181.7896 1191.7407 1195.9375 1232.9434 1254.8441 1278.7262 1298.8175 1310.6025 1340.0481 1345.7387 1349.5793 1388.2950 1393.4305 1414.5079 1424.9842 1451.1421 1461.7937 1465.3708 1467.6165 1469.2028 1475.8561 1479.8988 1481.3320 1483.3247 1488.4812 1491.4899 1497.4073 2862.9922 2909.3371 2911.3159 2967.6352 2973.4207 2976.5259 2979.2623 2982.7745 3017.1283 3022.5943 3034.3716 3035.9236 3037.8472 3048.0488 3067.5911 3070.2948 3072.1217 3077.0877 3081.4069 3083.0510
redmass: 2.8854 2.6688 2.3461 1.6594 1.8534 1.1594 1.0906 1.3724 1.2648 2.1544 2.3658 1.9973 2.2374 2.8870 2.5027 2.0570 2.9258 2.5350 3.3292 3.5377 4.3568 2.8445 1.1991 1.2427 2.0664 3.7208 1.9448 1.9464 1.9767 1.7807 1.6350 1.6185 2.6981 2.0049 1.8805 2.0716 1.3358 1.4963 1.8576 1.7319 2.3038 2.2463 1.8280 2.8824 1.4608 1.1840 1.3122 1.3718 1.4805 1.4690 1.5735 1.2133 1.2083 1.1585 1.1567 1.0517 1.0600 1.0601 1.0638 1.0533 1.0508 1.0508 1.0534 1.0436 1.0705 1.0767 1.0732 1.0701 1.0469 1.0483 1.0598 1.0503 1.0450 1.0398 1.0587 1.1001 1.1040 1.0955 1.0825 1.0845 1.0899 1.0985 1.0996 1.0991 1.0998 1.1007 1.1007
irintensity: 0.9078 0.2106 0.2437 0.2141 0.2236 0.0843 0.0859 1.3034 1.1321 2.2299 0.6447 5.8284 2.5633 0.8377 1.4328 0.6327 4.3168 1.8070 5.6108 3.7828 0.3388 0.6427 5.9464 9.4849 8.6432 17.2382 1.4562 6.2943 2.9623 0.9578 5.2617 16.8379 1.5050 5.3243 3.4859 15.4597 2.1733 1.3465 6.9042 1.1679 0.0834 0.5992 5.3939 2.4099 1.5751 3.1844 4.9566 3.5113 0.8920 0.1344 1.3688 21.2530 15.8020 3.5663 0.0327 1.8907 26.2821 4.1711 10.1469 0.6007 1.8462 11.4603 15.7446 4.0916 20.1838 5.6507 5.5353 82.5331 182.6432 26.0077 9.2028 36.6193 87.3182 16.3555 26.1389 13.9134 41.4812 19.5402 41.9964 42.6660 29.4729 44.8649 69.3632 50.8251 45.4943 32.2133 32.6258
temp: 298.150 k
press: 1.00000 atm
elementType: 7 7 6 6 6 6 6 6 6 6 6 1 1 1 1 1 1 1 1 1 1 1 1 1 1 1 1 1 1 1 1
symmnumber: 1
zpe: 735393.3 jmol-1
zpe.correction: 0.280097 hartree
zpe.thermalcorrener: 0.293332 hartree
zpe.thermalcorrenthalpy: 0.294276 hartree
zpe.thermalcorrgfe: 0.241498 hartree
zpe.sumelectzpe: -463.474633 hartree
zpe.sumelectthermal: -463.461397 hartree
zpe.sumelectthermalent: -463.460453 hartree
zpe.sumelectthermalfe: -463.513231 hartree
dipole: 0.8859 -0.0632 -0.0521
dipole: 0.8897
quadrupole: -70.5503 -68.0508 -72.8701
quadrupole: -0.5440 1.4464 1.4290
quadrupole: -0.0599 2.4396 -2.3797 -0.5440 1.4464 1.4290
hfenergy: -463.7547294 hartree
pointgroup: C01 [X(C9H20N2)]
dipole: -0.3478257 -0.0346068 0.0183792 debye
polarizability: 122.9205462|0.8491781|111.8175635|1.5075922|-1.6597603|94.8029588 unknown
InChI: InChI=1S/C9H20N2/c1-5-9(6-2)7-10(3)11(4)8-9/h5-8H2,1-4H3
charge 0 multiplicity 1
31 atoms
N  1.540355 -0.526144 0.537836
N  1.658011 0.419528 -0.646505
C  -0.71634 -0.102216 -0.163093
C  0.239862 -1.219256 0.334623
C  0.251884 0.665568 -1.122061
C  -1.146556 0.786843 1.045982
C  -1.926965 -0.680489 -0.945518
C  -2.072833 1.975469 0.710389
C  -2.901384 -1.533689 -0.103334
C  2.688089 -1.460184 0.520649
C  2.351278 1.651961 -0.197913
H  -0.082818 -1.67465 1.287276
H  0.31367 -2.022719 -0.441199
H  0.144056 0.284662 -2.156004
H  0.030069 1.750077 -1.134802
H  -0.225551 1.153273 1.537746
H  -1.652069 0.142468 1.79297
H  -1.535595 -1.298075 -1.780041
H  -2.486486 0.151873 -1.417745
H  -1.62068 2.655546 -0.036238
H  -3.047187 1.639175 0.31053
H  -2.276186 2.573289 1.617976
H  -2.38149 -2.384085 0.375442
H  -3.381063 -0.93848 0.694652
H  -3.705356 -1.948484 -0.738704
H  2.750627 -2.042207 -0.42749
H  2.5876 -2.155892 1.373613
H  3.629951 -0.899247 0.6483
H  1.810295 2.198748 0.608283
H  2.480831 2.319264 -1.068632
H  3.355781 1.39047 0.178014
