program: Gaussian 09
title: 000143085
version: EM64L-G09RevD.01
frameworkgroup: C1[X(C9H11BrN2)]
method: RPBEPBE
basis: SDD
operation: Freq
keyword: #p
keyword: freq=noraman
keyword: PBEPBE/SDD
title: #p freq=noraman PBEPBE/SDD
converged: YES YES NO NO
title: Mulliken charges:
elementType: Br N N C C C C C C C C C H H H H H H H H H H H
charge: -0.016544 -0.078030 -0.125371 0.376737 -0.138969 -0.590154 -0.628553 -0.377796 -0.352144 -0.187299 -0.220809 -0.254758 0.220978 0.232912 0.224488 0.230703 0.223915 0.300607 0.222729 0.237402 0.244598 0.224300 0.231058
chargesum: 0.00000
title: Mulliken charges with hydrogens summed into heavy atoms:
elementType: Br N N C C C C C C C C C
charge: -0.016544 -0.078030 -0.125371 0.376737 0.082009 0.097949 0.118698 -0.377796 -0.114742 0.057298 0.003491 -0.023700
polarizability: 2.02214500e+02 1.84297136e+01 1.50561178e+02 -1.21165127e+00 -3.63200241e-01 6.42397050e+01
1716.lowfreq: -9.3424 -4.4969 -0.0006 -0.0001 0.0005 7.0404 36.9248 59.7964 74.6718
frequency: 36.7101 59.7914 74.6707 92.8597 133.9987 141.9487 180.2904 217.3369 227.1516 275.9076 314.2741 349.3100 385.2812 445.2986 446.7614 518.2930 555.6737 615.6954 656.8966 721.7311 753.4305 828.6462 844.8599 878.0666 931.7676 948.9856 969.5482 1000.7954 1037.8924 1058.5487 1087.7022 1095.7744 1118.6411 1143.8310 1167.3016 1212.5383 1238.8560 1252.5920 1353.2966 1372.1686 1400.2694 1416.2872 1423.0870 1439.1854 1458.4605 1464.6036 1479.6119 1485.7179 1511.6956 1552.6256 1592.7698 1651.1516 2955.7897 2965.3942 2985.9322 3027.0235 3040.8944 3088.1175 3111.8191 3121.9969 3139.3216 3152.7814 3170.9615
redmass: 2.7229 5.6265 3.7341 1.2778 1.1834 4.5344 3.5362 2.5880 3.5143 6.4902 5.1726 2.7338 3.2509 3.4548 3.6402 5.4567 3.7585 6.1810 6.6993 2.8949 1.3932 5.0754 1.5145 3.9775 1.3766 1.4823 1.3166 7.4210 2.1047 1.3683 1.8506 1.2229 1.5926 1.3725 1.0539 2.7350 3.1225 1.5928 4.7576 1.4503 2.4605 1.1570 2.5233 1.2137 1.0483 1.4628 1.3478 1.0477 1.4421 5.8684 7.1077 6.2289 1.0356 1.0362 1.0867 1.1012 1.1016 1.0979 1.0983 1.0859 1.0898 1.0938 1.0998
irintensity: 0.9193 2.0081 2.4471 0.1654 0.2817 1.7440 1.3815 0.4308 2.1202 0.7292 4.7599 21.3640 1.7908 5.2401 4.3165 8.4267 2.0036 2.8186 22.7496 6.7798 94.4903 12.0617 2.4176 1.0686 4.4928 26.0228 0.0115 61.9614 13.8323 5.4301 236.0723 1.7306 1.0323 0.3283 0.4659 2.9540 19.8177 12.2674 12.2990 44.1898 61.1242 27.6644 10.6349 13.1714 8.7726 28.1749 45.8438 24.2602 22.2693 4.7156 190.2205 887.4560 90.4245 122.7207 52.7783 44.6561 31.1338 25.1206 0.7227 7.4312 8.2344 19.8751 21.0600
temp: 298.150 k
press: 1.00000 atm
elementType: 35 7 7 6 6 6 6 6 6 6 6 6 1 1 1 1 1 1 1 1 1 1 1
symmnumber: 1
zpe: 474801.6 jmol-1
zpe.correction: 0.180842 hartree
zpe.thermalcorrener: 0.193479 hartree
zpe.thermalcorrenthalpy: 0.194423 hartree
zpe.thermalcorrgfe: 0.139895 hartree
zpe.sumelectzpe: -471.616351 hartree
zpe.sumelectthermal: -471.603715 hartree
zpe.sumelectthermalent: -471.602771 hartree
zpe.sumelectthermalfe: -471.657299 hartree
dipole: -4.2714 2.2963 -0.8730
dipole: 4.9275
quadrupole: -57.5032 -75.7361 -83.8346
quadrupole: 1.3146 1.3930 -1.3533
quadrupole: 14.8548 -3.3781 -11.4766 1.3146 1.3930 -1.3533
hfenergy: -471.7971933 hartree
pointgroup: C01 [X(C9H11Br1N2)]
dipole: 1.373368 -1.1777026 -0.6965136 debye
dipolederiv: -0.0748865 -0.1749411 -0.0329342 -0.1193774 -0.6400916 -0.1174925 -0.0165591 -0.1052192 -0.0736154 -1.822217 0.1950026 0.1538644 -0.0715411 -0.3496396 -0.058987 -0.2421528 -0.0114987 -0.3929782 -2.1753696 0.1347846 0.0550609 0.5307032 -0.3248783 -0.0906921 0.4110526 -0.10827 -0.3933594 1.6811245 -0.2067296 -0.0259697 0.1151023 -0.2619535 -0.0690624 0.1548334 -0.0492859 0.0876392 2.5376531 -0.2780155 -0.1730875 -0.4759162 0.1923413 0.2138596 -0.2417038 0.176356 0.3099997 0.5650281 -0.1227716 -0.1881431 -0.2902924 0.2731874 -0.0055172 -0.4254556 0.0033586 0.2625916 0.0786037 0.0979987 0.1425627 0.2683765 0.2366705 -0.0199838 0.4049327 -0.041468 0.2741309 -0.3306051 0.3113785 0.0644087 0.3790467 1.0521377 0.2484531 0.0273539 0.1981351 -0.1066494 -0.320066 0.1462207 0.0722933 -0.335305 0.018796 -0.0014117 -0.0181453 0.0206609 -0.1886254 0.0915961 -0.054171 0.0050949 -0.117835 -0.1753714 -0.0171552 0.0223086 -0.0077754 -0.093261 0.0893712 -0.0848844 0.0030979 0.0376965 0.1061256 0.0456405 0.0191209 0.0340784 -0.1370388 -0.1140006 -0.0013293 0.0137814 -0.0141042 -0.1027048 0.0168442 -0.0006269 0.0118672 -0.1933712 0.034484 -0.0230423 -0.0279421 0.0880915 0.0462572 -0.1765413 -0.0078195 -0.1521615 -0.0881553 -0.1311881 -0.0320667 0.117925 -0.1323578 -0.0496911 0.1034941 0.1685175 0.0265248 0.0286234 0.0610697 -0.0855382 -0.1132916 -0.016672 0.0502026 -0.1001798 -0.019817 -0.0958021 -0.022004 -0.1355359 0.1259262 0.000389 0.1813531 -0.0172018 0.0440447 -0.0741942 0.1055268 0.0101111 -0.0535376 0.0436962 -0.1309186 0.0920519 -0.0227401 0.1111562 -0.170389 0.0490982 -0.0136767 0.1461331 0.0668359 0.1016698 0.0363406 0.0888697 -0.0422212 0.0610876 -0.033809 0.0784513 -0.0515901 -0.1291142 -0.0016234 -0.2018731 -0.0333935 0.0258179 0.0173904 0.0896777 0.024746 -0.0112762 0.1005288 -0.0084872 0.0797126 -0.0410558 -0.0190531 -0.0265478 -0.0231253 0.1515684 0.0216652 0.077711 0.00925 0.0996734 -0.0011935 -0.024306 0.0083176 -0.0216263 0.1542885 0.0389802 -0.0664275 -0.0158474 -0.0972384 -0.1030399 -0.0458541 -0.0267194 -0.0389946 0.1527838 -0.1254362 -0.041052 -0.0211532 -0.0356357 0.0583669 -0.0208529 -0.0247847 -0.0262475 0.1678012 unknown
polarizability: 208.0048469|2.8963877|139.4378091|-0.7601333|20.0175395|69.572727 unknown
InChI: InChI=1S/C9H11BrN2/c1-12(2)7-11-9-6-4-3-5-8(9)10/h3-7H,1-2H3
charge 0 multiplicity 1
23 atoms
Br -0.944204 2.867157 0.577615
N  2.995972 -0.230882 -0.226433
N  0.734933 0.229372 0.275201
C  -0.634978 -0.014504 0.090246
C  1.645482 -0.349191 -0.473671
C  3.992645 -0.808892 -1.132858
C  3.486907 0.545965 0.92121
C  -1.584082 1.04191 0.23542
C  -1.164486 -1.318481 -0.169894
C  -2.96979 0.8280 0.115986
C  -2.550131 -1.543649 -0.292518
C  -3.460906 -0.472129 -0.151166
H  1.409227 -0.949296 -1.374025
H  4.612069 -0.018587 -1.602087
H  3.492205 -1.377831 -1.934736
H  4.668031 -1.497096 -0.587989
H  4.061686 -0.098355 1.614483
H  2.615005 0.96649 1.445194
H  4.142268 1.370036 0.578768
H  -0.463884 -2.159693 -0.234362
H  -3.660204 1.669456 0.228768
H  -2.919981 -2.557157 -0.484591
H  -4.539685 -0.638143 -0.236062
