program: Gaussian 09
title: 000143070
version: EM64L-G09RevD.01
frameworkgroup: C1[X(C11H16ClN3)]
method: RPBEPBE
basis: SDD
operation: Freq
keyword: #p
keyword: freq=noraman
keyword: PBEPBE/SDD
title: #p freq=noraman PBEPBE/SDD
converged: YES YES NO NO
title: Mulliken charges:
elementType: Cl N N N C C C C C C C C C C C H H H H H H H H H H H H H H H H
charge: -0.091037 -0.163099 -0.077808 -0.142833 0.444458 -0.525519 0.393073 -0.381908 -0.318002 -0.227507 -0.643700 -0.645684 -0.141957 -0.588553 -0.628752 0.256821 0.237962 0.239795 0.230865 0.214337 0.230294 0.213765 0.233001 0.233408 0.234384 0.229343 0.227322 0.226007 0.217512 0.290571 0.223440
chargesum: 0.00000
title: Mulliken charges with hydrogens summed into heavy atoms:
elementType: Cl N N N C C C C C C C C C C C
charge: -0.091037 -0.163099 -0.077808 -0.142833 0.444458 -0.268698 0.393073 -0.143945 -0.318002 0.012289 0.031796 0.034490 0.092427 0.094118 0.102771
polarizability: 2.62602037e+02 1.10400616e+00 1.57800465e+02 7.04873799e-01 2.97827101e+00 8.71352154e+01
1716.lowfreq: -5.8425 -3.2588 -0.0019 -0.0019 -0.0016 7.6149 38.4234 50.5497 58.2806
frequency: 38.3743 50.4895 58.2797 69.5521 88.0244 98.3087 102.6454 137.0315 169.1136 179.9279 200.8092 212.6634 230.0642 265.1344 267.4239 298.9542 327.1778 348.3916 366.4805 402.6994 454.3519 460.8964 483.5674 551.6076 600.2772 629.3388 640.3358 691.9098 720.9684 776.2081 847.9874 864.0110 893.4894 917.5662 952.7273 970.3249 1011.9515 1058.1665 1059.9838 1089.3704 1097.5491 1109.2415 1110.9293 1144.4056 1150.9386 1153.1125 1205.4304 1242.9613 1259.0179 1268.8470 1347.8691 1367.6464 1372.0335 1389.6557 1414.7310 1431.4412 1432.3670 1444.7364 1459.1259 1460.2222 1462.8216 1472.9530 1476.1608 1482.7091 1486.1962 1495.2619 1509.4096 1512.0610 1557.0539 1603.9953 1654.6335 2930.8579 2940.0767 2952.1969 2961.2241 2994.0502 2997.2778 3020.8449 3031.9058 3034.4972 3087.9447 3090.4979 3100.4187 3108.4857 3149.9963 3174.6035 3177.7927
redmass: 2.9729 2.8648 3.8471 3.4272 2.8162 1.4603 2.0669 1.0574 4.4801 1.7050 1.3711 2.2095 2.4172 5.9371 3.6170 6.1473 4.2893 3.3267 3.2737 2.6127 3.4074 3.2500 4.1056 4.0233 5.5704 4.1163 5.8897 2.9205 6.0585 1.5018 1.8081 3.6890 4.9898 1.3168 1.4730 2.8373 5.0246 1.4903 1.3705 1.7667 1.2278 1.3159 1.2405 1.3726 1.5452 1.5963 2.1134 3.2492 1.4695 3.9365 2.5106 6.6366 1.7294 2.6985 1.1549 1.3181 1.3918 1.3726 1.0449 1.4126 1.0449 1.0503 1.1968 2.0433 1.0468 1.1028 1.2040 1.2921 6.5944 6.0422 6.3613 1.0372 1.0398 1.0356 1.0356 1.0990 1.1022 1.1014 1.0894 1.1014 1.0974 1.0956 1.0936 1.0976 1.0882 1.0911 1.0937
irintensity: 3.2586 0.2738 4.0454 2.8792 2.0705 0.1579 0.6268 0.1928 0.0770 0.3610 0.7853 2.5823 1.9431 0.4123 1.8637 1.6462 5.2570 11.6014 14.6913 0.7933 7.3198 4.6725 0.8680 1.7995 23.7225 6.6228 4.6159 2.0467 4.8505 38.3395 42.8851 10.8478 4.3702 1.4081 21.5494 45.7770 32.6019 20.4792 6.1279 266.5855 3.1273 1.5690 0.0338 0.7638 1.3859 28.4384 1.6588 20.8098 12.3056 40.8835 56.1370 25.2001 28.9063 49.7507 25.7193 26.1858 33.2094 14.6571 9.6952 30.1160 1.5179 20.3194 24.2365 51.6879 20.9506 8.8404 148.3882 18.0360 61.5138 786.6898 638.1573 122.3647 91.2045 87.7047 148.8283 12.1214 87.9686 48.3367 37.3915 34.3233 25.3714 4.7631 54.2912 1.2991 4.3988 11.9989 10.0340
temp: 298.150 k
press: 1.00000 atm
elementType: 17 7 7 7 6 6 6 6 6 6 6 6 6 6 6 1 1 1 1 1 1 1 1 1 1 1 1 1 1 1 1
symmnumber: 1
zpe: 663417.7 jmol-1
zpe.correction: 0.252682 hartree
zpe.thermalcorrener: 0.269723 hartree
zpe.thermalcorrenthalpy: 0.270667 hartree
zpe.thermalcorrgfe: 0.206878 hartree
zpe.sumelectzpe: -1051.919487 hartree
zpe.sumelectthermal: -1051.902447 hartree
zpe.sumelectthermalent: -1051.901502 hartree
zpe.sumelectthermalfe: -1051.965292 hartree
dipole: -0.0715 -2.8189 1.4578
dipole: 3.1744
quadrupole: -62.7293 -94.1545 -99.9400
quadrupole: 2.6339 -2.8365 1.3896
quadrupole: 22.8786 -8.5466 -14.3320 2.6339 -2.8365 1.3896
hfenergy: -1052.1721698 hartree
pointgroup: C01 [X(C11H16Cl1N3)]
dipole: -0.0989318 1.2342974 -0.1627024 debye
polarizability: 262.0762994|5.2590708|147.8986758|5.751598|25.2642313|97.5627423 unknown
InChI: InChI=1S/C11H16ClN3/c1-14(2)8-13-11-7-9(15(3)4)5-6-10(11)12/h5-8H,1-4H3
charge 0 multiplicity 1
31 atoms
Cl -1.332746 -2.644945 -0.947245
N  3.347927 1.082107 0.164949
N  -3.767454 0.724495 -0.216793
N  -1.473109 0.373983 0.210383
C  2.260582 0.238772 -0.102944
C  0.923235 0.665659 0.141862
C  -0.208959 -0.150982 -0.128424
C  2.45957 -1.080069 -0.625286
C  0.043149 -1.457116 -0.646244
C  1.352643 -1.911198 -0.88021
C  4.71609 0.607981 -0.063968
C  3.118092 2.414591 0.731242
C  -2.51235 0.286201 -0.586546
C  -4.90541 0.637316 -1.135272
C  -4.015088 1.258823 1.128111
H  0.70719 1.65191 0.559072
H  3.462814 -1.46574 -0.821412
H  1.510609 -2.924538 -1.26283
H  4.883653 0.330714 -1.125162
H  5.428893 1.408766 0.189788
H  4.962214 -0.276888 0.560103
H  4.082671 2.931158 0.860349
H  2.484547 3.038383 0.067583
H  2.62097 2.365631 1.722734
H  -2.471307 -0.111731 -1.614962
H  -5.701978 -0.012929 -0.72158
H  -4.580241 0.211963 -2.099648
H  -5.342046 1.638226 -1.324895
H  -4.428802 2.284566 1.070909
H  -3.054659 1.276988 1.666055
H  -4.7322 0.6197 1.680081
