program: Gaussian 09
title: 000143062
version: EM64L-G09RevD.01
frameworkgroup: C1[X(C6H12N3OP)]
method: RPBEPBE
basis: SDD
operation: Freq
keyword: #p
keyword: freq=noraman
keyword: PBEPBE/SDD
title: #p freq=noraman PBEPBE/SDD
converged: NO NO NO NO
title: Mulliken charges:
elementType: P O N N N C C C C C C H H H H H H H H H H H H
charge: 0.983293 -0.644847 0.003631 0.003514 0.003985 -0.731163 -0.730747 -0.730643 -0.475827 -0.476564 -0.476277 0.285370 0.285402 0.285142 0.285550 0.285156 0.285367 0.263561 0.256209 0.256384 0.263572 0.263672 0.256261
chargesum: 0.00000
title: Mulliken charges with hydrogens summed into heavy atoms:
elementType: P O N N N C C C C C C
charge: 0.983293 -0.644847 0.003631 0.003514 0.003985 -0.160392 -0.160055 -0.160120 0.043943 0.043392 0.043656
polarizability: 1.17507481e+02 4.59944266e-03 9.36649429e+01 3.68350058e-03 -5.34675525e-03 9.36384090e+01
1716.lowfreq: -26.1210 -3.4347 -0.0011 0.0008 0.0019 19.4536 180.7821 181.4868 250.6020
frequency: 180.7777 181.4692 250.5976 251.5134 332.5158 355.6052 357.9748 370.5997 425.5997 427.8594 506.4318 533.4572 535.9633 582.7685 680.5555 682.4736 683.0655 767.8915 770.3081 770.9520 875.6010 876.3898 912.2069 919.2584 940.3983 940.6671 977.3872 999.6567 1014.0123 1015.5202 1071.1980 1072.3673 1158.2159 1219.3995 1247.2295 1248.5537 1264.3714 1265.4078 1270.7415 1284.2711 1323.9704 1325.8128 1329.8642 1341.9050 1344.8001 1420.7100 1422.4505 1427.4895 1436.8900 1437.8558 1457.2306 3005.8682 3006.2194 3008.2799 3016.3665 3016.6042 3025.3376 3083.0641 3083.1405 3083.6320 3090.8399 3091.0060 3095.9821
redmass: 5.0346 5.1633 2.8206 2.8054 2.0952 4.7468 4.7641 7.2881 1.9745 1.9611 1.9022 3.8060 3.8545 3.2991 6.0904 5.6250 6.4102 4.6143 1.9793 2.9735 1.7468 1.7505 5.3895 3.3806 2.9982 2.9771 7.3699 4.2486 3.3451 3.3315 1.6954 1.6940 1.0570 3.7817 1.1694 1.1703 1.5333 1.5347 1.1808 1.2054 1.2701 1.2714 1.1872 1.1648 1.1636 1.0811 1.0804 1.0732 1.0845 1.0850 1.0999 1.0574 1.0574 1.0576 1.0578 1.0579 1.0622 1.1078 1.1079 1.1073 1.1083 1.1083 1.1089
irintensity: 18.4717 18.7965 12.8686 12.7741 0.0146 4.2375 4.2809 1.8052 4.8164 4.3754 0.0110 36.5677 36.8903 0.5195 9.8447 5.1533 12.9923 24.2452 7.7976 17.7474 7.6357 7.6626 9.8941 0.1070 100.7552 100.3639 177.0296 0.0375 0.5830 0.4631 5.9602 6.0638 0.0039 23.1494 0.3931 0.2646 22.4163 22.9572 0.1477 7.4831 0.0616 0.1184 0.0087 0.2723 0.2461 5.5130 6.0761 24.4768 30.7482 30.1228 4.7839 30.5905 30.8196 26.4341 48.9946 48.3957 40.2637 3.4844 3.6055 0.0516 17.8932 18.0746 29.0902
temp: 298.150 k
press: 1.00000 atm
elementType: 15 8 7 7 7 6 6 6 6 6 6 1 1 1 1 1 1 1 1 1 1 1 1
symmnumber: 1
zpe: 497027.8 jmol-1
zpe.correction: 0.189308 hartree
zpe.thermalcorrener: 0.198416 hartree
zpe.thermalcorrenthalpy: 0.199360 hartree
zpe.thermalcorrgfe: 0.155975 hartree
zpe.sumelectzpe: -815.609067 hartree
zpe.sumelectthermal: -815.599959 hartree
zpe.sumelectthermalent: -815.599015 hartree
zpe.sumelectthermalfe: -815.642400 hartree
dipole: 4.2675 0.0054 0.0039
dipole: 4.2675
quadrupole: -91.9580 -72.1791 -72.1798
quadrupole: -0.0090 0.0010 -0.0060
quadrupole: -13.1857 6.5932 6.5925 -0.0090 0.0010 -0.0060
hfenergy: -815.7983751 hartree
pointgroup: C01 [X(C6H12N3O1P1)]
dipole: 1.6789483 -0.0021885 0.0004392 debye
dipolederiv: 1.0897507 -0.0001075 -0.0005998 -0.0001762 0.8522787 -0.0000697 -0.0001633 0.000155 0.852503 -0.983837 0.0002097 0.0005458 0.0003772 -0.610466 0.0001745 -0.0002791 0.000117 -0.6105849 -0.5943934 -0.1515596 0.0109128 -0.2361091 -0.7998233 0.0185314 0.0166001 0.0192026 -0.5310033 -0.5948593 0.0665767 -0.1365753 0.1031478 -0.5824921 0.1069894 -0.2122161 0.107061 -0.7492345 -0.5954033 0.0846071 0.1262337 0.1318992 -0.615591 -0.1258532 0.1958311 -0.126162 -0.7170835 0.2156319 0.0459849 -0.0032908 0.0188434 0.1500393 -0.0180279 -0.0013986 -0.0180312 -0.1051373 0.2165599 -0.0204947 0.0415502 -0.0082612 -0.0566861 -0.1016512 0.0172495 -0.1020081 0.1019455 0.2168923 -0.0262055 -0.0387189 -0.0105145 -0.0253885 0.1195107 -0.0155214 0.1194958 0.071329 0.3195257 0.1248076 0.1848924 0.1532464 0.6209918 -0.1160843 0.2269886 -0.1164227 0.5266764 0.3193585 0.0979817 -0.2005608 0.1201988 0.6512801 0.0989832 -0.2457009 0.0987888 0.4969855 0.3194595 -0.2223242 0.015539 -0.2729073 0.4498511 0.0175149 0.0187439 0.0178133 0.6980183 0.0453954 0.0045426 0.0113986 0.0127877 -0.0180993 -0.088392 0.0633398 -0.1286794 -0.0182562 0.0451612 0.0031771 -0.0121991 0.0039869 0.0121379 0.0839517 -0.0646552 0.1242594 -0.0485032 0.0453366 -0.0121151 -0.0018128 -0.0612225 -0.1126989 0.0739445 -0.0205862 0.0336747 0.0759837 0.0451017 0.0090005 0.0089849 0.0538806 0.0575728 -0.0978589 0.035824 -0.057772 -0.093687 0.0453517 0.0075634 -0.0095424 0.0485677 0.0753406 0.0749491 -0.0427359 0.0345164 -0.1118722 0.0453247 -0.0117881 0.0034656 -0.0578565 -0.1233169 -0.0465266 0.0289249 -0.0062566 0.0869398 -0.1466576 -0.0257553 -0.0382447 0.0304807 0.0553464 0.037179 0.0453602 0.0372998 0.0855495 0.0799526 0.075325 0.1117372 0.0125203 -0.0171761 -0.0704198 0.0184091 -0.0703359 -0.0738502 0.0799059 0.0592031 -0.1212913 0.0097017 0.001198 0.0598586 -0.0200066 0.059876 -0.0923187 -0.1466673 -0.020045 0.0412823 0.0241947 0.0459337 -0.0316575 -0.0493169 -0.031687 0.0953365 -0.1466246 0.0460447 -0.0031205 -0.0544163 0.1103196 -0.0055561 0.0038876 -0.0056445 0.0307528 0.0797344 -0.1346292 0.0094137 -0.0223695 -0.1205522 0.01051 0.0014213 0.0107394 0.029511 unknown
polarizability: 117.5074794|-0.0027596|93.6398282|-0.0079741|-0.0080143|93.6635253 unknown
InChI: InChI=1S/C6H12N3OP/c10-11-4-7-1-8(5-11)3-9(2-7)6-11/h1-6H2
charge 0 multiplicity 1
23 atoms
P  -1.586982 0.000277 0.001216
O  -3.208515 0.000909 0.000909
N  0.833329 1.446133 -0.101323
N  0.832768 -0.635298 1.302499
N  0.8319 -0.809492 -1.201638
C  -0.641117 1.674012 -0.116286
C  -0.641073 -0.737086 1.508659
C  -0.642086 -0.937255 -1.391624
C  1.288894 0.786817 1.166458
C  1.288865 0.616622 -1.264611
C  1.28808 -1.403254 0.097523
H  -0.938643 2.309749 0.736263
H  -0.940007 2.183362 -1.049464
H  -0.938354 -1.793698 1.630132
H  -0.939762 -0.186453 2.4181
H  -0.939346 -0.514091 -2.367418
H  -0.940081 -2.000362 -1.368202
H  2.392456 0.78998 1.171459
H  0.923104 1.369134 2.029088
H  0.923257 1.072871 -2.200109
H  2.392473 0.618184 -1.269194
H  2.391661 -1.409379 0.097545
H  0.921381 -2.441181 0.169719
