program: Gaussian 09
title: 000143052
version: EM64L-G09RevD.01
frameworkgroup: C1[X(C20H14O2)]
method: RPBEPBE
basis: SDD
operation: Freq
keyword: #pfreq=noraman
keyword: PBEPBE/SDD
title: #p freq=noraman PBEPBE/SDD
converged: YES YES NO NO
title: Mulliken charges:
elementType: O O C C C C C C C C C C C C C C C C C C C C H H H H H H H H H H H H H H
charge: -0.295202 -0.262756 0.026123 -0.297698 0.243554 0.253685 0.388083 -0.425332 -0.419891 0.241450 0.220238 -0.399100 -0.385816 -0.213289 -0.211839 -0.365786 -0.344772 -0.234140 -0.228791 -0.240822 -0.224024 -0.223676 0.272144 0.264628 0.255934 0.243196 0.266066 0.229444 0.229419 0.251401 0.248485 0.226629 0.227235 0.229227 0.227732 0.228261
chargesum: 0.00000
title: Mulliken charges with hydrogens summed into heavy atoms:
elementType: O O C C C C C C C C C C C C C C C C C C C C
charge: -0.295202 -0.262756 0.026123 -0.025553 0.243554 0.253685 0.388083 -0.160705 -0.163957 0.241450 0.220238 -0.155903 -0.119750 0.016156 0.017580 -0.114386 -0.096287 -0.007511 -0.001556 -0.011594 0.003708 0.004586
polarizability: 2.58892693e+02 5.74655405e-01 2.14153153e+02 -6.26877226e+00 4.51734332e+00 1.61262283e+02
1716.lowfreq: -8.3094 -4.7376 -0.0008 0.0002 0.0005 6.7065 28.9379 37.4637 47.8454
frequency: 28.8442 37.4331 47.8270 69.1491 87.6683 129.0253 169.2351 220.6044 234.0902 266.6885 278.4204 305.9366 324.2903 356.6083 401.9229 404.4371 435.5437 449.2346 501.5821 509.6145 539.9649 540.9591 570.6287 591.5574 615.6105 617.4015 626.0754 678.0695 698.9751 704.0679 719.1957 737.5114 754.6255 756.2147 761.2170 769.4891 830.3388 834.0025 850.3809 859.0806 882.3762 892.8052 929.3454 937.7611 952.6008 956.3822 967.2456 984.0901 987.0447 989.8973 994.4193 995.7157 999.9898 1001.5270 1025.5091 1030.4656 1076.6741 1084.5367 1092.9829 1136.4667 1152.4113 1156.7268 1160.8631 1164.5633 1172.6728 1188.1808 1204.0577 1227.0766 1257.8571 1270.2365 1279.2848 1315.2843 1316.6942 1380.1262 1389.5739 1402.2486 1435.1763 1439.5637 1444.0520 1446.9640 1471.5007 1483.0543 1589.8887 1597.2955 1604.5355 1606.0656 1613.7886 1621.8619 3079.2092 3123.7952 3127.6026 3132.6598 3136.4052 3142.2003 3144.8685 3150.6128 3155.6084 3159.1108 3163.3904 3165.4766 3172.1247 3174.8631
redmass: 3.8073 5.5373 4.9683 4.8713 4.6142 4.0126 6.2621 5.8463 5.0909 5.7477 5.3776 5.1225 6.8523 5.5878 2.9999 3.2718 3.6211 4.1734 4.9458 4.4718 4.3937 6.3403 5.3531 5.5309 6.1601 5.3534 6.5770 6.2499 4.6522 1.8992 4.6868 5.2906 2.6477 1.2806 1.7337 1.8791 4.5912 4.6152 1.4666 1.2478 1.4321 2.8524 1.3768 1.8145 4.0514 1.6737 1.2973 1.5500 3.9268 6.1119 1.3519 5.0526 1.8287 1.6709 2.0260 2.0950 2.2795 2.5196 1.8174 1.6068 1.7624 1.4405 1.1249 1.4087 1.0557 1.1202 2.3151 3.1865 1.7729 1.4772 2.8181 1.3089 1.3304 8.4795 8.9873 6.2342 2.2425 2.4454 2.5950 2.3726 2.9429 2.3528 6.2196 7.6447 7.3709 7.2018 6.2296 7.8370 1.0878 1.0848 1.0858 1.0883 1.0852 1.0902 1.0936 1.0901 1.0959 1.0974 1.0947 1.0999 1.0981 1.1005
irintensity: 0.0549 0.8719 0.6925 0.6669 0.4888 0.2965 4.5396 0.2875 0.2414 0.5186 0.1590 0.0695 6.1825 0.9410 1.4941 5.7690 3.0800 4.6159 6.1651 8.1266 0.1853 2.2892 12.3734 2.3660 2.8681 20.9307 2.7768 2.4482 2.3124 43.2443 2.1447 10.8189 34.1915 113.1142 51.1354 52.0093 4.5197 15.3619 1.5029 0.3669 4.8429 27.1729 4.7776 22.3458 28.4946 8.4742 0.0804 9.7660 69.0769 3.8425 2.1261 24.1930 1.4640 11.7151 47.6824 18.0176 1.4948 17.6103 1.4685 3.1148 2.4769 10.2636 5.5042 14.2099 0.5329 10.0642 11.4343 279.2975 5.6327 1.6036 19.7185 20.3864 1.3374 0.1735 12.5368 17.7874 17.5229 5.7810 2.4580 5.4043 187.9866 16.8349 0.0242 17.9498 1.2202 0.4895 7.3324 2.6729 17.4008 1.4152 1.1796 4.1020 1.6895 12.1329 26.4387 15.0604 16.5881 31.9996 13.3082 27.7564 11.0092 15.8922
temp: 298.150 k
press: 1.00000 atm
elementType: 8 8 6 6 6 6 6 6 6 6 6 6 6 6 6 6 6 6 6 6 6 6 1 1 1 1 1 1 1 1 1 1 1 1 1 1
symmnumber: 1
zpe: 727633.9 jmol-1
zpe.correction: 0.277141 hartree
zpe.thermalcorrener: 0.293515 hartree
zpe.thermalcorrenthalpy: 0.294459 hartree
zpe.thermalcorrgfe: 0.232109 hartree
zpe.sumelectzpe: -919.433991 hartree
zpe.sumelectthermal: -919.417617 hartree
zpe.sumelectthermalent: -919.416673 hartree
zpe.sumelectthermalfe: -919.479022 hartree
dipole: 0.6128 2.3528 -0.4195
dipole: 2.4672
quadrupole: -113.7242 -115.1630 -124.5065
quadrupole: -1.4175 0.4237 1.1304
quadrupole: 4.0737 2.6349 -6.7086 -1.4175 0.4237 1.1304
hfenergy: -919.7111317 hartree
pointgroup: C01 [X(C20H14O2)]
dipole: 0.4038341 -0.8237156 0.3172059 debye
polarizability: 256.8448134|8.9238064|216.0593775|8.2677685|-2.6895158|161.4039386 unknown
InChI: InChI=1S/C20H14O2/c1-2-8-14(9-3-1)20-16-11-5-4-10-15(16)19(20)21-17-12-6-7-13-18(17)22-20/h1-13,19H
charge 0 multiplicity 1
36 atoms
O  -0.413655 1.189667 0.574694
O  -1.170345 0.04591 -1.941212
C  0.579586 0.236486 0.016971
C  0.073183 -0.468424 -1.361716
C  0.504611 -1.176864 0.625493
C  0.014347 -1.775817 -0.555261
C  1.910436 0.959517 -0.036135
C  0.742345 -1.905848 1.801084
C  -0.278297 -3.145818 -0.639651
C  -1.77171 0.950602 0.262534
C  -2.153424 0.401049 -0.98576
C  3.124787 0.237951 0.086461
C  1.958069 2.356733 -0.274422
C  0.440704 -3.292822 1.735153
C  -0.057918 -3.896442 0.546854
C  -2.754611 1.366857 1.181121
C  -3.513423 0.272719 -1.323344
C  4.366547 0.901177 -0.031149
C  3.199699 3.018547 -0.387767
C  4.408842 2.293886 -0.269356
C  -4.121937 1.246912 0.842677
C  -4.501281 0.702726 -0.407847
H  0.803468 -0.425371 -2.184249
H  1.12316 -1.448881 2.71992
H  -0.661555 -3.620809 -1.548355
H  3.100796 -0.840826 0.278434
H  1.020461 2.914623 -0.351794
H  0.590183 -3.919724 2.621805
H  -0.276346 -4.970595 0.553308
H  -2.433434 1.791092 2.137526
H  -3.77638 -0.148136 -2.298874
H  5.298344 0.333009 0.067466
H  3.224445 4.099313 -0.567076
H  5.371829 2.80928 -0.357812
H  -4.886203 1.576394 1.554255
H  -5.56032 0.609526 -0.669876
