program: Gaussian 09
title: 000143016
version: EM64L-G09RevD.01
frameworkgroup: C1[X(C11H14)]
method: RPBEPBE
basis: SDD
operation: Freq
keyword: #p
keyword: freq=noraman
keyword: PBEPBE/SDD
title: #p freq=noraman PBEPBE/SDD
converged: YES YES NO NO
title: Mulliken charges:
elementType: C C C C C C C C C C C H H H H H H H H H H H H H H
charge: 0.261025 0.351284 -0.270362 -0.444844 -0.821152 -0.384265 -0.388838 -0.668626 -0.239171 -0.238584 -0.247057 0.212859 0.204492 0.204675 0.236355 0.223755 0.224372 0.229803 0.230063 0.222501 0.213774 0.216128 0.221826 0.222711 0.227276
chargesum: 0.00000
title: Mulliken charges with hydrogens summed into heavy atoms:
elementType: C C C C C C C C C C C
charge: 0.261025 0.351284 -0.057503 -0.035677 -0.136670 -0.154462 -0.158775 -0.016223 -0.017345 -0.015873 -0.019781
polarizability: 1.79163967e+02 -4.49087258e+00 1.16379326e+02 -7.92758481e+00 8.16202819e+00 6.98312446e+01
1716.lowfreq: -9.4475 -3.8222 0.0002 0.0004 0.0007 10.2062 41.2773 51.2672 86.4241
frequency: 39.6107 50.8851 86.4047 133.9558 173.1893 186.7873 224.5078 322.2349 344.6464 380.3780 402.5678 411.8717 492.7263 551.8058 587.4494 617.1483 697.6964 717.7009 766.1106 796.4457 843.8697 866.4015 885.7102 916.4866 963.9149 971.8516 987.6223 990.8761 1023.1773 1031.0218 1040.1419 1058.7030 1074.0042 1092.2454 1147.9561 1172.7625 1197.1893 1244.2422 1276.5067 1307.9652 1318.0284 1351.8108 1378.8431 1387.7875 1396.3801 1435.2031 1462.4282 1471.6721 1474.1147 1479.6457 1485.5222 1488.0561 1581.0518 1609.9077 1656.1011 2966.6564 2973.5972 2977.5574 3041.2208 3047.4304 3073.9279 3080.5205 3086.5821 3102.5364 3120.3363 3127.7799 3142.4513 3150.2659 3164.1132
redmass: 2.6542 3.0389 3.1357 1.6039 1.2604 3.2969 1.2576 3.1331 3.0680 3.2696 2.8818 3.1708 2.4734 2.6754 3.4597 6.3449 1.7411 2.7524 1.7781 1.3875 1.2702 1.6433 1.6649 1.4966 2.1452 1.4127 4.3700 1.4106 2.2683 1.9379 1.4760 1.9061 1.6846 1.5918 2.3308 1.0508 1.1289 1.3706 1.8808 1.5850 1.3763 1.5728 3.3270 1.3095 1.2644 2.2829 1.0785 1.0954 1.0453 1.0766 1.3596 1.4630 5.6400 6.0133 6.6055 1.0651 1.0406 1.0355 1.0930 1.0954 1.0982 1.0963 1.0948 1.0954 1.0842 1.0873 1.0920 1.0953 1.1012
irintensity: 0.1010 0.0547 1.3831 0.2999 0.3078 0.5691 0.0154 0.2054 0.8728 1.3507 0.1800 0.3920 5.7173 5.4716 2.6144 0.1257 45.1059 8.2296 74.8802 4.0181 0.8195 9.6004 10.9591 1.4887 9.6952 0.1543 0.2950 0.0713 5.8876 14.1117 0.5186 10.8782 5.0290 5.2478 3.1017 0.0483 0.0747 1.4043 6.8866 0.1498 1.4204 3.1599 1.4341 8.6486 19.0661 10.0304 2.6908 14.5134 13.5996 8.1057 29.3342 4.8842 1.8643 13.6923 5.3226 40.9528 28.5211 46.4190 5.5553 23.0393 31.0257 41.0833 57.0554 41.2428 2.9853 2.1236 21.7435 46.8866 19.2081
temp: 298.150 k
press: 1.00000 atm
elementType: 6 6 6 6 6 6 6 6 6 6 6 1 1 1 1 1 1 1 1 1 1 1 1 1 1
symmnumber: 1
zpe: 562892.6 jmol-1
zpe.correction: 0.214394 hartree
zpe.thermalcorrener: 0.225637 hartree
zpe.thermalcorrenthalpy: 0.226581 hartree
zpe.thermalcorrgfe: 0.176605 hartree
zpe.sumelectzpe: -426.739864 hartree
zpe.sumelectthermal: -426.728621 hartree
zpe.sumelectthermalent: -426.727677 hartree
zpe.sumelectthermalfe: -426.777654 hartree
dipole: 0.6331 0.1951 -0.0254
dipole: 0.6630
quadrupole: -60.7062 -61.2253 -71.1262
quadrupole: 0.2684 -1.7169 2.1531
quadrupole: 3.6464 3.1273 -6.7737 0.2684 -1.7169 2.1531
hfenergy: -426.9542583 hartree
pointgroup: C01 [X(C11H14)]
dipole: 0.2514766 -0.0037489 -0.0691175 debye
dipolederiv: -0.0060873 -0.0227418 -0.0924255 -0.0935794 -0.0734232 -0.0329449 -0.1707264 0.0270987 0.2632647 0.458142 -0.0341564 0.0244811 0.0395873 0.0171687 0.0206359 0.0066985 -0.00491 -0.1075011 0.1474219 -0.0315218 0.0573029 -0.1235824 -0.2594557 -0.0053149 0.0268016 -0.0083575 -0.0145568 -0.0282147 -0.018426 -0.0154697 -0.0276885 0.1218221 -0.0623291 -0.1511616 -0.0224017 0.0939183 -0.0592498 0.0074194 0.0495189 0.0640125 0.0946813 0.0322693 0.0494338 0.009054 -0.1293436 -0.209498 0.006477 -0.0463677 0.049549 -0.1358121 -0.0993288 -0.0969334 -0.0657924 0.014422 -0.1918126 -0.0564122 0.0353475 -0.0942624 -0.0866272 -0.0672656 0.119445 -0.0941577 -0.0462745 -0.0165335 -0.0373425 -0.0413286 0.0629456 0.0176829 0.0010522 0.062784 -0.0261051 0.0950899 0.0434646 -0.0648963 0.0416239 -0.1027049 -0.0824284 -0.1005541 0.0903001 -0.1075759 0.0197257 0.0129134 -0.0023429 -0.0455758 0.0206837 -0.090989 -0.104429 -0.0821136 -0.1073793 0.0705395 -0.0184605 -0.0289392 -0.0449302 -0.0180669 -0.1563483 -0.0295826 -0.0306124 -0.0295916 -0.1037438 0.0215228 0.0130293 0.0561124 0.030889 0.1368261 -0.013462 0.1005353 -0.0224612 -0.1131255 0.0180704 -0.0020695 0.0371112 -0.0153467 0.0529383 -0.0399131 0.1120389 -0.0784196 -0.1441571 -0.0740737 0.0464082 -0.0554428 0.078372 -0.1059644 0.0922068 -0.0391776 0.1175808 0.0296425 0.0207461 -0.1021994 -0.1027082 -0.0860908 0.0107203 -0.0795334 -0.0715447 -0.0568557 -0.0063985 0.1182367 0.0514057 -0.0309206 0.0356308 -0.0940771 0.1080191 -0.0355612 0.0543025 0.0008616 -0.1500517 0.0608729 0.1017154 0.0569187 0.0817485 -0.0229944 0.0376077 0.0050223 0.1032447 0.0837274 -0.0295452 0.0797027 -0.0371425 0.1070349 0.0852912 0.0665087 0.0816098 -0.0492221 0.0257896 0.0855227 -0.0807382 0.0735989 0.0762036 0.0724791 -0.0554396 0.0772181 0.0304016 0.1014382 0.0526567 -0.0377987 -0.0020515 -0.1000814 0.07497 -0.0180318 0.1159932 0.0170498 0.0953002 0.0053251 0.0969365 -0.0061302 0.061658 -0.0260987 0.0363384 -0.0662539 -0.1501701 -0.2853717 0.0053013 -0.0354959 -0.0011577 0.0693024 -0.0237809 -0.0161389 -0.0165776 0.0863282 -0.0129694 0.0725632 -0.0760706 0.0873525 0.0894036 0.0947411 -0.0943512 0.0975158 0.0038718 0.0398477 -0.014191 0.0735771 -0.0262119 0.1039821 0.1023457 0.0995465 0.0962876 -0.0582695 -0.1342981 0.0378028 0.0518429 0.0344759 0.1440341 0.023521 0.0537539 0.0251565 0.0944022 unknown
polarizability: 178.4097149|-10.6960017|74.1516721|4.9414503|-15.5979997|112.8131498 unknown
InChI: InChI=1S/C11H14/c1-3-7-10(2)11-8-5-4-6-9-11/h4-9H,3H2,1-2H3
charge 0 multiplicity 1
25 atoms
C  0.917147 -0.229242 -0.542158
C  -0.539266 -0.0747 -0.223047
C  1.841422 -0.356297 0.462245
C  3.342378 -0.514123 0.350431
C  1.29702 -0.207299 -2.016178
C  -1.421939 0.5753 -1.1326
C  -1.102025 -0.585411 0.983811
C  4.102781 0.7111 0.929087
C  -2.793364 0.737642 -0.837625
C  -2.470574 -0.423913 1.281209
C  -3.327159 0.243668 0.373637
H  1.480052 -0.294892 1.500435
H  3.659239 -0.679112 -0.694795
H  3.65105 -1.416871 0.918021
H  0.659981 -0.897162 -2.600278
H  1.164871 0.802981 -2.450872
H  2.347736 -0.494136 -2.177349
H  -1.033636 0.973788 -2.075848
H  -0.467043 -1.142797 1.681242
H  3.866129 1.6256 0.35626
H  3.81919 0.891516 1.98262
H  5.196205 0.55083 0.892804
H  -3.444661 1.250802 -1.554573
H  -2.874116 -0.832912 2.214763
H  -4.391918 0.364639 0.601959
