program: Gaussian 09
title: 000142958
version: EM64L-G09RevD.01
frameworkgroup: C1[X(C7H10O2)]
method: RPBEPBE
basis: SDD
operation: Freq
keyword: #pfreq=noraman
keyword: PBEPBE/SDD
title: #p freq=noraman PBEPBE/SDD
converged: YES YES NO NO
title: Mulliken charges:
elementType: O O C C C C C C C H H H H H H H H H H
charge: -0.272396 -0.217905 -0.223225 -0.672136 -0.601134 0.268598 0.077316 -0.030212 -0.748468 0.229274 0.229246 0.212477 0.230015 0.230062 0.270001 0.269951 0.255430 0.246664 0.246441
chargesum: 0.00000
title: Mulliken charges with hydrogens summed into heavy atoms:
elementType: O O C C C C C C C
charge: -0.272396 -0.217905 0.235295 0.000418 -0.061182 0.268598 0.077316 -0.030212 0.000067
polarizability: 1.23784772e+02 8.52471441e+00 6.77888167e+01 6.28557341e-02 3.20079240e-02 5.29803598e+01
1716.lowfreq: -21.2235 -11.2982 -4.4623 -4.0374 -0.0012 -0.0011 -0.0011 16.7173 57.2628
frequency: -20.3558 15.1643 57.0245 63.1652 132.5758 158.4610 185.4047 245.1260 263.5506 318.5905 351.6274 377.3364 411.6066 540.2535 675.6703 758.9288 799.6736 832.5720 901.8310 928.3147 1024.4489 1031.6902 1034.1355 1104.3487 1116.3316 1135.7529 1178.6724 1191.9390 1249.3271 1317.7844 1357.8498 1400.6047 1401.1732 1432.8611 1462.3870 1462.7961 1463.3547 1474.6621 1487.1166 1661.9631 2304.5246 2977.2431 2984.2932 2997.4900 3011.1864 3028.8544 3065.6937 3066.9414 3069.9775 3094.3638 3108.6676
redmass: 1.0506 3.5239 2.9296 3.8679 2.0180 4.0947 2.5020 1.2601 4.3979 5.1382 3.9244 4.0275 6.0292 3.3786 5.9311 4.0179 1.0963 4.2176 5.1499 2.2764 2.3586 1.3971 1.3926 3.8300 2.5062 1.4604 2.9462 1.1062 1.1368 1.8565 1.3997 1.2613 1.2308 1.0973 1.0416 1.0416 1.0401 1.0594 1.0700 10.0928 11.6619 1.0350 1.0597 1.0358 1.0582 1.0976 1.0987 1.0984 1.1067 1.0986 1.1026
irintensity: 0.0270 0.3402 0.3096 3.0013 7.0395 4.6359 18.7437 1.1651 6.0997 8.7309 0.2875 0.7304 4.9590 3.7776 8.6012 4.7332 4.3865 2.3985 18.8573 4.0714 54.2088 6.6882 4.9833 354.4259 135.5935 5.7872 13.5164 0.0744 0.0003 36.9338 2.5395 23.3893 0.9591 25.2918 13.4169 13.2400 12.5059 5.3848 13.4357 161.3834 4.8345 33.3254 20.8125 21.8500 19.0394 3.1499 16.3495 14.1870 8.4273 30.0423 46.0025
temp: 298.150 k
press: 1.00000 atm
elementType: 8 8 6 6 6 6 6 6 6 1 1 1 1 1 1 1 1 1 1
symmnumber: 1
zpe: 399046.2 jmol-1
zpe.correction: 0.151989 hartree
zpe.thermalcorrener: 0.162543 hartree
zpe.thermalcorrenthalpy: 0.163487 hartree
zpe.thermalcorrgfe: 0.114012 hartree
zpe.sumelectzpe: -422.437112 hartree
zpe.sumelectthermal: -422.426558 hartree
zpe.sumelectthermalent: -422.425613 hartree
zpe.sumelectthermalfe: -422.475089 hartree
dipole: -0.9430 -1.2771 0.0054
dipole: 1.5875
quadrupole: -36.4327 -56.7474 -52.6385
quadrupole: -0.9731 0.0242 0.0555
quadrupole: 12.1735 -8.1412 -4.0323 -0.9731 0.0242 0.0555
hfenergy: -422.5891003 hartree
pointgroup: C01 [X(C7H10O2)]
dipole: 0.3664945 -0.5057546 -0.0017928 debye
dipolederiv: -1.8680453 0.1181304 0.0057537 0.0511611 -0.5191785 -0.0013338 0.006857 -0.000931 -0.2851781 -0.7205545 -0.0268351 0.0013335 0.258758 -0.8780703 -0.0023581 0.0034132 -0.0012484 -0.2913475 0.8805685 0.0677111 -0.0014929 0.2976887 0.2691529 -0.0009313 -0.0012932 -0.0005475 0.3556261 -0.1371546 0.0596361 0.0007347 0.0292152 0.0277879 -0.0002285 0.0007182 -0.0002905 0.0616423 0.1285686 -0.1373903 0.0019989 -0.2734067 -0.1164289 0.001872 0.0049159 0.002096 0.1732416 1.875953 -0.0499696 -0.0072703 -0.2822458 1.1715331 0.0034366 -0.0117368 0.0015261 0.193076 -0.1902573 0.0259253 0.0001475 0.0045898 -0.1861509 -0.0000992 0.0000885 0.000232 -0.1430692 0.0481735 -0.1171429 0.0010734 -0.1036603 -0.094926 0.0000738 0.0005246 -0.0007682 -0.1569034 0.0647925 0.0228738 -0.0001204 0.0442687 0.0927938 -0.0011329 0.0014745 -0.0000652 0.1159828 -0.0396101 0.023784 -0.040818 -0.0699754 -0.0073779 0.0855561 -0.002675 0.1046215 -0.0606376 -0.0392787 0.0229159 0.0407926 -0.0704969 -0.0067075 -0.0849219 0.0022441 -0.1045561 -0.0616622 -0.1131574 -0.0942229 0.0005683 -0.1201196 0.000763 0.0002173 0.0005679 0.0001319 0.1160903 0.1041732 0.0015054 0.012346 0.0578517 0.0129808 0.1086742 -0.0186435 0.1178441 -0.0634148 0.1042298 0.0007414 -0.0134362 0.0570526 0.0137812 -0.108753 0.0177151 -0.1175428 -0.06418 -0.0237648 0.0331547 -0.0411465 0.045917 0.0726046 0.0672413 -0.0564244 0.0945057 0.0195585 -0.0231945 0.0355597 0.0400126 0.0474628 0.0699135 -0.0681617 0.0542892 -0.0955508 0.0230951 0.0281305 0.0134229 -0.0007316 0.0700109 -0.1079896 -0.0092146 0.000539 -0.0099118 0.1287653 -0.0357712 0.0047604 -0.0780512 -0.0152827 0.0979184 -0.0637951 -0.1237429 -0.0504921 -0.039529 -0.0438013 -0.0045604 0.0783059 -0.0287891 0.0876004 0.0738587 0.1211685 0.060947 -0.0211561 unknown
polarizability: 123.6276194|-9.0246851|67.9459174|0.0704016|-0.0423321|52.9804113 unknown
InChI: InChI=1S/C7H10O2/c1-3-5-6-7(8)9-4-2/h4,6H2,1-2H3
charge 0 multiplicity 1
19 atoms
O  1.817948 -0.415346 -0.00456
O  0.346727 1.395776 0.006197
C  2.973091 0.537082 -0.006624
C  4.241188 -0.310075 -0.01241
C  -0.502841 -0.957629 0.007619
C  0.543768 0.165129 0.002342
C  -1.89391 -0.488976 -0.000225
C  -3.067654 -0.112983 -0.00661
C  -4.461233 0.357844 -0.013733
H  2.888586 1.181922 -0.899887
H  2.89458 1.178751 0.889481
H  5.129978 0.346678 -0.01431
H  4.288634 -0.955626 0.881084
H  4.282528 -0.952542 -0.908428
H  -0.301318 -1.589859 0.894838
H  -0.295443 -1.604773 -0.867169
H  -4.500693 1.461574 0.03268
H  -4.987902 0.039912 -0.932067
H  -5.022932 -0.036459 0.852781
