program: Gaussian 09
title: 000142949
version: EM64L-G09RevD.01
frameworkgroup: C1[X(C7H16N2O)]
method: RPBEPBE
basis: SDD
operation: Freq
keyword: #p
keyword: freq=noraman
keyword: PBEPBE/SDD
title: #p freq=noraman PBEPBE/SDD
converged: YES YES NO NO
title: Mulliken charges:
elementType: O N N C C C C C C C H H H H H H H H H H H H H H H H
charge: -0.332396 -0.406756 -0.152316 -0.328346 -0.389841 -0.352086 -0.686268 0.318373 -0.630095 -0.663167 0.222245 0.190068 0.198329 0.258760 0.188052 0.191864 0.308121 0.214317 0.212856 0.209711 0.219097 0.286898 0.218026 0.234377 0.241955 0.228223
chargesum: 0.00000
title: Mulliken charges with hydrogens summed into heavy atoms:
elementType: O N N C C C C C C C
charge: -0.332396 -0.098635 -0.152316 0.083966 0.067247 0.027829 -0.049385 0.318373 0.093927 0.041388
polarizability: 1.14056858e+02 -4.44325543e+00 9.06649289e+01 6.51478638e+00 2.71779734e+00 7.80806445e+01
1716.lowfreq: -18.9025 -4.8173 0.0007 0.0008 0.0010 9.7549 19.7949 46.8818 58.8336
frequency: 15.1477 46.7117 58.7829 72.1148 115.4207 116.5893 161.0147 195.1167 212.9779 230.0479 257.8596 292.1516 368.7522 382.3711 427.1580 490.3975 531.9586 580.9561 709.0569 736.0305 773.2133 846.1855 850.6280 934.9957 969.5921 999.8025 1051.5528 1060.6276 1097.1033 1106.6492 1120.7719 1132.6134 1136.2691 1201.6487 1226.8030 1257.3505 1266.7348 1285.7405 1308.8850 1341.1445 1348.2412 1370.2513 1391.5890 1416.6919 1444.8560 1447.4455 1458.0299 1472.4035 1476.2152 1477.6510 1478.0254 1485.5394 1492.8366 1498.9170 1506.1880 1610.1053 2932.3809 2955.1951 2958.3228 2973.4199 2975.1995 2985.1927 2997.7694 3000.9566 3029.0854 3043.8090 3071.1387 3071.9237 3076.2164 3094.1148 3110.6783 3583.7207
redmass: 3.5239 3.2020 1.6283 1.5664 2.2412 2.4659 1.2917 2.5730 2.0355 1.1644 2.2681 2.8080 3.2223 2.5303 1.1937 2.9149 2.9751 4.3258 7.1561 1.3149 2.1355 2.0727 1.8426 1.6955 1.6564 2.3250 2.5942 1.4145 1.2346 2.5493 2.2329 1.7713 1.3520 2.1396 1.3434 1.6501 3.0036 1.1059 1.2896 1.8841 1.6384 1.4070 1.2126 1.1556 1.1516 1.1407 1.0830 1.0749 1.0799 1.0497 1.0999 1.0729 1.0474 1.0791 1.8326 5.6936 1.0389 1.0588 1.0367 1.0427 1.0550 1.0667 1.1005 1.0984 1.1022 1.1005 1.1003 1.0995 1.0980 1.0941 1.0959 1.0768
irintensity: 2.5641 1.1007 10.8253 0.2360 3.5793 1.3683 0.4735 1.2862 0.2526 0.1811 2.5860 2.0675 26.1116 0.9123 115.9435 14.9396 4.6600 0.9862 15.7462 15.9731 0.6411 3.3171 1.6701 4.1280 14.1214 31.4877 4.6035 16.9313 0.0291 10.5927 6.4545 1.1611 0.0126 152.6672 8.4341 22.5737 7.1316 1.8819 10.7125 88.4151 3.2961 10.8204 9.0425 36.9307 33.6109 6.6145 6.1939 19.3334 44.6834 9.4077 82.9551 14.1559 7.8786 19.4622 299.0387 244.9377 64.8182 31.5697 98.2483 20.2267 61.5880 45.7133 48.9541 9.4351 50.7317 48.5524 79.3211 46.7349 13.3391 18.7734 1.1609 6.6520
temp: 298.150 k
press: 1.00000 atm
elementType: 8 7 7 6 6 6 6 6 6 6 1 1 1 1 1 1 1 1 1 1 1 1 1 1 1 1
symmnumber: 1
zpe: 599347.3 jmol-1
zpe.correction: 0.228279 hartree
zpe.thermalcorrener: 0.241500 hartree
zpe.thermalcorrenthalpy: 0.242444 hartree
zpe.thermalcorrgfe: 0.186749 hartree
zpe.sumelectzpe: -460.248418 hartree
zpe.sumelectthermal: -460.235197 hartree
zpe.sumelectthermalent: -460.234253 hartree
zpe.sumelectthermalfe: -460.289948 hartree
dipole: 0.1064 4.1084 1.5612
dipole: 4.3963
quadrupole: -56.7158 -66.0445 -62.4946
quadrupole: -7.5501 0.9570 -0.6662
quadrupole: 5.0358 -4.2929 -0.7430 -7.5501 0.9570 -0.6662
hfenergy: -460.4766973 hartree
pointgroup: C01 [X(C7H16N2O1)]
dipole: 0.0466257 1.5722112 0.7194777 debye
dipolederiv: -0.7153247 0.0480755 -0.0815569 0.0376957 -1.0188479 -0.2633282 -0.1266878 -0.286425 -0.5608454 -1.3380915 0.0428968 -0.1510932 -0.0792684 -0.3330591 0.0129143 -0.3726128 0.0756242 -0.6691092 -1.109189 0.3902671 -0.1113058 0.4131277 -0.7949342 -0.0587818 -0.1935148 -0.0233993 -0.4373919 -0.0115525 -0.0402925 0.0595028 -0.0188654 0.082 0.0255138 0.0913839 0.0041204 0.014187 0.6326072 -0.1381292 0.001024 -0.3797124 0.1776567 -0.0951616 -0.0239475 -0.0398015 0.3137647 0.0841693 -0.0331947 0.0768409 -0.0261664 0.0613202 -0.0039027 0.1008581 -0.0078992 0.1203758 0.0007291 -0.0382139 0.0621712 -0.0561781 0.0647834 0.0258613 0.0434555 0.0126462 0.0385824 1.8881769 -0.4563557 0.4101333 -0.3305212 1.2950453 0.3229345 0.643427 0.2793697 0.6319379 0.5190347 0.0335173 0.1269134 0.1759872 -0.000603 -0.0738141 0.2200706 -0.132026 0.3093065 0.0795758 0.1100437 -0.0495348 0.0034047 0.4199905 0.0846155 -0.1293226 0.1251714 0.2994053 0.0596519 -0.0346814 -0.0690675 -0.0311703 0.0453581 0.0073982 -0.0555309 -0.0199203 -0.1236382 -0.1344196 0.1435316 -0.0119436 0.1089414 -0.0800341 0.0148227 -0.0023025 0.0228583 0.0836784 -0.0630265 0.0443724 -0.0865816 0.0354555 0.091765 -0.0496906 -0.0781912 0.0199821 -0.1708363 0.043766 -0.0891713 0.031056 -0.0027247 -0.0525953 0.0325494 0.0584213 -0.0339012 0.1028508 0.0254835 -0.0330302 -0.0541795 -0.0195987 0.048035 0.0013546 -0.071631 -0.0354056 -0.2041323 -0.0762038 0.1449863 0.0081446 0.1404601 -0.0812951 0.0045122 -0.0103822 0.0098595 0.054312 0.2040235 -0.0028383 -0.0913132 0.0400266 0.0767764 -0.0799584 -0.1004478 -0.0618391 0.2618549 0.0453305 -0.0064393 -0.1003022 0.0000679 0.0937075 -0.0292417 -0.0387126 0.0002194 -0.1558886 -0.001984 -0.1116788 0.0175519 -0.1597677 -0.1479639 -0.0065965 0.0064622 -0.0321283 0.0777898 -0.0698447 0.105685 0.007955 0.1676894 -0.0369769 0.013192 -0.0113972 0.039041 0.0714886 -0.2159515 -0.0025193 0.047001 0.0064115 0.1150194 0.0099088 0.1299899 0.0221055 -0.0259997 0.189025 0.0280177 0.0406512 -0.0696029 0.0185077 -0.0960317 -0.0026092 -0.0463954 0.0983187 -0.018442 0.0009139 -0.0463462 0.0582763 -0.0260812 0.1808109 -0.1089987 0.1359148 -0.0686789 0.1021846 -0.0439845 -0.0561855 -0.0069682 0.0157143 0.0339562 0.0093555 -0.0594678 -0.1888628 -0.0739227 0.132712 -0.0199966 0.0792028 0.0358951 -0.0067887 -0.0534273 0.0217214 0.108405 -0.0458054 -0.1944902 0.0404613 -0.0862023 -0.0691834 -0.0070484 0.0762922 0.0099747 0.0191254 unknown
polarizability: 114.1920388|-4.7927689|90.235662|5.8443565|3.5830779|78.3747304 unknown
InChI: InChI=1S/C7H16N2O/c1-4-5-6-8-7(10)9(2)3/h8H,4-6H2,1-3H3
charge 0 multiplicity 1
26 atoms
O  -1.23908 -1.607693 -0.566601
N  -0.083704 -0.119978 0.814557
N  -2.217938 0.462057 -0.037912
C  2.211431 -0.701566 -0.079738
C  1.080298 -1.013663 0.929845
C  2.854089 0.691102 0.106626
C  3.999251 0.95726 -0.894828
C  -1.183699 -0.48382 0.033014
C  -3.4042 0.146539 -0.845975
C  -2.171408 1.74255 0.677043
H  1.804017 -0.796072 -1.104968
H  2.993644 -1.481614 0.02644
H  1.470377 -0.950168 1.965397
H  0.710057 -2.039316 0.761711
H  3.240362 0.781163 1.143708
H  2.076958 1.474125 -0.012178
H  -0.027842 0.80457 1.237476
H  3.632363 0.899074 -1.936761
H  4.445992 1.957868 -0.74739
H  4.804146 0.206661 -0.782141
H  -4.31839 0.110543 -0.221139
H  -3.24529 -0.843322 -1.301048
H  -3.551388 0.894213 -1.649868
H  -2.0763 1.605889 1.774207
H  -3.110441 2.289674 0.495845
H  -1.341403 2.392522 0.326977
