program: Gaussian 09
title: 000142909
version: EM64L-G09RevD.01
frameworkgroup: C1[X(C5H5ClN2O)]
method: RPBEPBE
basis: SDD
operation: Freq
keyword: #p
keyword: freq=noraman
keyword: PBEPBE/SDD
title: #p freq=noraman PBEPBE/SDD
converged: NO NO NO NO
title: Mulliken charges:
elementType: Cl O N N C C C C C H H H H H
charge: -0.046525 -0.386095 -0.043706 -0.658418 0.382136 -0.229762 -0.295042 -0.064594 -0.132357 0.299266 0.231550 0.263455 0.357805 0.322288
chargesum: 0.00000
title: Mulliken charges with hydrogens summed into heavy atoms:
elementType: Cl O N N C C C C C
charge: -0.046525 -0.386095 -0.043706 0.021675 0.382136 0.069504 -0.063492 -0.064594 0.131098
polarizability: 1.31098944e+02 4.17266303e+00 9.02738613e+01 2.39945147e-02 2.69866762e-02 3.13819822e+01
1716.lowfreq: -12.8404 -7.4936 -5.4084 0.0017 0.0018 0.0034 118.1059 210.0594 222.7561
frequency: 118.0999 210.0585 222.7555 319.2383 347.6686 367.9051 382.6319 431.1730 477.2827 556.3431 572.7938 637.2525 643.2069 698.5485 778.8230 789.5232 834.2028 881.4606 905.7577 1010.9493 1068.9028 1139.5520 1190.2868 1272.3246 1326.0809 1332.3463 1383.9090 1506.3333 1523.0173 1554.4989 1650.2447 3163.5486 3186.8227 3217.7797 3446.5368 3693.0915
redmass: 6.1364 6.3033 8.5264 4.0150 4.7458 5.9165 1.2484 3.0204 6.1628 4.2471 6.2660 1.1288 7.0774 4.4408 1.4242 5.0487 1.3912 5.8359 1.3265 1.7620 2.1281 1.2162 5.5815 1.4318 3.1882 4.7688 2.5100 2.8847 1.9168 3.3485 6.0130 1.0894 1.0972 1.0944 1.0521 1.0957
irintensity: 1.6830 0.1220 0.6449 8.2242 6.3551 17.4614 158.1009 22.7635 0.7638 19.1332 2.9525 130.6439 15.6140 2.4228 52.7972 2.6021 39.8048 62.9151 0.1057 10.1606 27.5749 24.9668 69.3465 1.1997 19.7524 30.6612 17.2312 75.6402 109.1648 124.5910 219.4852 6.3899 1.2964 3.8382 76.9772 82.6947
temp: 298.150 k
press: 1.00000 atm
elementType: 17 8 7 7 6 6 6 6 6 1 1 1 1 1
symmnumber: 1
zpe: 256245.8 jmol-1
zpe.correction: 0.097599 hartree
zpe.thermalcorrener: 0.105411 hartree
zpe.thermalcorrenthalpy: 0.106355 hartree
zpe.thermalcorrgfe: 0.064995 hartree
zpe.sumelectzpe: -837.617931 hartree
zpe.sumelectthermal: -837.610119 hartree
zpe.sumelectthermalent: -837.609175 hartree
zpe.sumelectthermalfe: -837.650535 hartree
dipole: -1.6768 3.9215 0.0628
dipole: 4.2654
quadrupole: -54.1141 -56.3587 -62.1794
quadrupole: -9.3264 -0.2512 0.0729
quadrupole: 3.4366 1.1921 -4.6287 -9.3264 -0.2512 0.0729
hfenergy: -837.7155301 hartree
pointgroup: C01[X(C5H5Cl1N2O1)]
dipole: -0.6658588 -1.5402026 0.0247131 debye
dipolederiv: -0.7732422 -0.0929234 -0.0318854 -0.1232871 -0.122652 -0.0024372 -0.0301373 -0.0009419 -0.0537322 -0.6535104 0.3464139 -0.0367123 0.3866961 -0.8201201 0.0464019 -0.0352856 0.0414838 -0.3607659 0.0820422 -0.3417308 0.0201115 -0.820137 0.6709497 -0.0749338 0.0393722 -0.0458837 0.0899051 -1.5154701 -0.1728277 -0.0248634 -0.1196118 -0.1494462 -0.0261457 -0.0068746 -0.0247836 -0.6835526 1.5840107 0.2403492 0.0578433 0.2671775 -0.3025353 0.0345733 0.0565418 0.032077 0.1373338 -0.1595394 0.0278225 -0.0048545 -0.0742953 0.071912 -0.0126081 -0.0004452 -0.0077217 -0.0841984 -0.1854969 -0.2833003 0.0152811 0.1818647 0.1574101 -0.0113426 -0.0089306 -0.0352068 -0.1792525 1.0251643 0.1033777 0.0509225 0.2452694 -0.0217053 0.0095129 0.0428618 0.0026031 -0.0769006 -0.2149984 0.2212446 -0.0179524 -0.0375381 0.0597745 -0.0111332 -0.0032508 0.0022771 -0.1134581 0.08755 0.010526 -0.0061003 -0.0078636 0.0665016 0.0063587 -0.004515 0.0069522 0.1903222 0.0304454 -0.0846437 -0.0025807 -0.068038 -0.031769 0.0084198 -0.0040143 0.0088173 0.1772097 0.0549131 0.066891 -0.0100767 0.0583599 0.036105 0.0108884 -0.0095156 0.0105462 0.1765611 0.3478618 -0.0607757 -0.0009735 0.0595279 0.2203334 0.0117963 -0.0128098 0.0052056 0.3803145 0.2902698 0.0195768 -0.008159 0.0518756 0.1652417 0.0106493 -0.0229969 0.0045755 0.4002138 unknown
polarizability: 130.7890399|-4.1031669|90.1244592|5.3508244|-3.3884655|31.8412882 unknown
InChI: InChI=1S/C5H5ClN2O/c6-4-1-2-5(7)8(9)3-4/h1-3H,7H2
charge 0 multiplicity 1
14 atoms
Cl 3.445624 0.341716 0.091556
O  -1.44065 1.951686 -0.247131
N  -0.572907 0.921235 -0.149247
N  -2.475703 -0.404346 -0.170893
C  -1.108775 -0.386141 -0.104946
C  0.793647 1.121762 -0.086924
C  -0.230732 -1.487585 0.003058
C  1.656991 0.026351 0.017063
C  1.166158 -1.29457 0.064887
H  1.112406 2.163207 -0.12608
H  -0.650777 -2.496361 0.040752
H  1.846239 -2.145755 0.147253
H  -2.910482 0.522727 -0.24822
H  -3.006638 -1.268227 -0.181829
