program: Gaussian 09
title: 000010425
version: EM64L-G09RevD.01
frameworkgroup: C1[X(C6H14N)]
method: RPBEPBE
basis: SDD
operation: Freq
keyword: #p
keyword: freq=noraman
keyword: PBEPBE/SDD
title: #p freq=noraman PBEPBE/SDD
converged: YES YES NO NO
title: Mulliken charges:
elementType: N C C C C C C H H H H H H H H H H H H H H
charge: -0.103564 -0.425807 -0.560346 -0.543040 -0.546346 -0.063465 -0.512779 0.269497 0.280482 0.271437 0.267968 0.282139 0.269239 0.269298 0.269924 0.262817 0.285359 0.265095 0.262178 0.261497 0.238418
chargesum: 1.00000
title: Mulliken charges with hydrogens summed into heavy atoms:
elementType: N C C C C C C
charge: -0.103564 0.124172 0.261197 0.265421 0.266925 0.198713 -0.012865
polarizability: 8.38224184e+01 -5.49187794e+00 6.38411086e+01 4.03945626e+00 2.14887375e-01 5.68890689e+01
1716.lowfreq: -24.4367 -0.0006 -0.0005 0.0002 5.4834 16.3158 66.2935 100.9001 191.8352
frequency: 66.1396 100.8569 191.8336 248.8216 266.5316 274.8642 326.4543 349.9019 387.5288 427.6010 449.3744 469.0344 612.7787 746.7056 835.4862 895.3361 941.6773 945.3087 972.8982 1004.9507 1014.5425 1047.9040 1079.8948 1102.4566 1153.3099 1203.9819 1220.7576 1242.6997 1297.8604 1300.6308 1345.9272 1423.9356 1424.3646 1434.3275 1452.0624 1453.1295 1461.6447 1467.3823 1470.8472 1484.6329 1487.3157 1500.2569 1652.8480 3018.0543 3024.6254 3026.2847 3029.9927 3094.3450 3100.9846 3129.5235 3139.3303 3142.0092 3144.5719 3146.6901 3152.3036 3155.1044 3214.6030
redmass: 2.2453 2.3863 1.0949 1.8436 1.0339 1.2239 2.3737 2.4609 2.2393 2.3537 2.1445 2.0085 1.9219 2.9219 3.3592 1.9013 2.0875 2.2230 1.9301 1.1219 1.3526 1.1972 1.3003 1.3280 1.5812 1.6149 1.7389 1.8233 1.3966 1.2709 1.3129 1.1424 1.1427 1.1515 1.1350 1.0514 1.1054 1.0419 1.0709 1.0551 1.0528 1.0522 4.3322 1.0586 1.0324 1.0321 1.0341 1.1042 1.0643 1.0955 1.1053 1.1056 1.1050 1.1051 1.1053 1.1048 1.1149
irintensity: 0.2097 0.2869 0.0464 0.1518 0.2712 0.3501 0.5126 0.0777 0.1854 0.4244 1.7670 2.7119 4.9724 6.5345 65.8569 17.0745 8.4828 17.9048 8.8471 90.7502 7.2279 0.1197 1.4849 1.1139 0.0791 2.7787 0.1075 0.6315 4.7981 0.9541 1.0299 21.5621 19.1378 19.8932 14.3548 0.6533 7.4486 0.9314 2.3028 53.9025 39.8059 75.3501 2.7358 6.2358 3.5371 3.7622 2.7039 1.1494 3.4208 3.2028 1.1472 0.1044 4.2181 7.9663 0.7381 3.5320 4.9026
temp: 298.150 k
press: 1.00000 atm
elementType: 7 6 6 6 6 6 6 1 1 1 1 1 1 1 1 1 1 1 1 1 1
symmnumber: 1
zpe: 506948.8 jmol-1
zpe.correction: 0.193087 hartree
zpe.thermalcorrener: 0.202121 hartree
zpe.thermalcorrenthalpy: 0.203065 hartree
zpe.thermalcorrgfe: 0.160130 hartree
zpe.sumelectzpe: -290.915679 hartree
zpe.sumelectthermal: -290.906645 hartree
zpe.sumelectthermalent: -290.905700 hartree
zpe.sumelectthermalfe: -290.948636 hartree
dipole: -2.3163 -0.2217 0.1553
dipole: 2.3321
quadrupole: -28.4939 -35.8676 -38.7180
quadrupole: -0.6547 1.2338 0.6570
quadrupole: 5.8659 -1.5078 -4.3582 -0.6547 1.2338 0.6570
hfenergy: -291.1087657 hartree
pointgroup: C01 [X(C6H14N1)]
dipole: -0.9118655 0.0977943 -0.0276897 debye
dipolederiv: -0.523856 -0.0207302 0.0516834 0.0610537 -0.3023764 -0.0158145 -0.0700239 0.0058233 -0.3248528 0.7282462 0.0058181 0.1121865 -0.1435395 0.0894767 -0.0206354 0.222927 -0.0876256 0.2320806 0.0573394 0.0443351 0.0300748 0.0751589 0.2398732 0.1065684 0.0405805 0.1140463 0.1322765 0.2116712 -0.0314068 -0.1200984 -0.0263863 0.0721475 0.0236689 -0.1934115 0.0138981 0.1829521 0.0097115 0.0373834 -0.0103386 -0.0016054 0.2237413 -0.1109361 0.0005455 -0.1107552 0.1311098 -0.2766119 -0.0104556 -0.1009679 -0.043729 0.0684793 0.1198458 -0.1492844 0.117231 -0.1962482 0.0147106 0.0366796 -0.1212968 0.0954242 0.0322933 0.1218923 -0.091533 0.1464046 -0.1518075 0.0386245 0.0099152 -0.0116634 0.0318502 -0.0359641 -0.0960636 -0.0066228 -0.0394466 0.0704469 -0.0327625 -0.0713509 0.0600546 -0.0404693 0.0240364 0.0815675 0.0142274 0.0506787 0.0525579 0.1378711 0.0003231 -0.0094123 -0.005522 0.0213424 0.0350812 0.0047594 0.0941679 0.0100987 -0.0181411 0.0167246 -0.0741864 0.0735065 0.0813706 0.0184458 -0.0470795 -0.0111668 0.0996038 0.0421094 0.0090456 0.0984065 -0.0279623 0.090863 -0.0009544 0.082624 -0.0154508 0.0643111 0.0785035 -0.0776788 -0.0351838 -0.0355773 0.0212652 -0.0826608 0.0106115 -0.0551775 0.0716504 0.0053634 0.0221818 -0.0278669 0.0264233 0.1268355 0.0087194 -0.083305 0.0250926 0.0160136 0.1108222 0.042088 0.0053484 -0.0065736 -0.0172014 0.0833612 0.0319983 0.0441593 0.0793651 0.126304 -0.0280572 -0.0122268 -0.0186564 0.0234205 -0.03332 -0.0068737 -0.0957758 0.0066997 0.0554958 -0.0013578 0.0924006 0.0262083 0.0752631 -0.0268477 0.0749629 0.0027632 0.0841657 -0.0180909 0.0067836 -0.0896292 -0.0359775 0.1006376 0.0019227 -0.0554498 0.0240442 0.0868626 0.0883118 -0.0442628 0.0398091 -0.02775 -0.0308763 -0.0773947 0.0958803 -0.0691095 0.1052119 0.0393375 0.0208448 0.0730514 0.0168936 0.1054754 -0.0511622 0.081713 -0.0490374 0.1358869 0.1250403 0.0331771 0.049855 0.0072299 -0.0101028 -0.0852835 0.0427538 -0.104764 0.1116153 unknown
polarizability: 83.7187671|6.1487423|63.5170919|-3.4333382|1.3506301|57.3167369 unknown
InChI: InChI=1S/C6H14N/c1-5-6-7(2,3)4/h5H,1,6H2,2-4H3
charge 1 multiplicity 1
21 atoms
N  -0.870095 0.037377 -0.013754
C  0.423029 -0.195329 0.849511
C  -1.152625 -1.184742 -0.884203
C  -2.043346 0.261176 0.93837
C  -0.690872 1.266394 -0.900522
C  1.651237 -0.530476 0.042765
C  2.716258 0.304367 -0.062638
H  0.563194 0.732627 1.429438
H  0.159314 -1.013779 1.543572
H  -1.200376 -2.080262 -0.245658
H  -2.116336 -1.04063 -1.396616
H  -0.35156 -1.295134 -1.628425
H  -1.814142 1.109913 1.600482
H  -2.948974 0.48091 0.352493
H  -2.200273 -0.647937 1.538738
H  -0.560525 2.154102 -0.262519
H  0.199808 1.127094 -1.529756
H  -1.586475 1.386461 -1.529217
H  1.706875 -1.533772 -0.398422
H  3.621324 0.003872 -0.600464
H  2.730861 1.298466 0.402025
