program: Gaussian 09
title: 000142874
version: EM64L-G09RevD.01
frameworkgroup: C1[X(C9H16)]
method: RPBEPBE
basis: SDD
operation: Freq
keyword: #p
keyword: freq=noraman
keyword: PBEPBE/SDD
title: #p freq=noraman PBEPBE/SDD
converged: YES YES NO NO
title: Mulliken charges:
elementType: C C C C C C C C C H H H H H H H H H H H H H H H H
charge: -0.429667 -0.524817 -0.521983 0.556693 0.554178 -0.821186 -0.818647 -0.745242 -0.744359 0.208979 0.207442 0.227666 0.196361 0.193711 0.227149 0.228023 0.220799 0.225692 0.228059 0.220910 0.224318 0.224302 0.218375 0.225582 0.217661
chargesum: 0.00000
title: Mulliken charges with hydrogens summed into heavy atoms:
elementType: C C C C C C C C C
charge: -0.013247 -0.100790 -0.101123 0.556693 0.554178 -0.146671 -0.145360 -0.302565 -0.301116
polarizability: 9.80506206e+01 -5.67184970e-01 1.13716597e+02 6.76686030e+00 1.04928842e-01 7.22387047e+01
1716.lowfreq: -37.4345 -23.4133 -20.3708 0.0005 0.0006 0.0006 24.5048 36.4789 60.2073
frequency: -8.0523 36.2784 59.9741 106.5742 146.6577 173.7952 193.1434 302.2130 353.9112 382.7298 390.8699 415.1315 421.6550 513.3457 542.9558 691.9075 696.1537 723.2930 779.7753 849.3871 871.0593 922.4455 936.4916 942.9939 965.0461 979.9722 984.1722 1024.8270 1034.1846 1044.1068 1063.3316 1075.8593 1148.3695 1166.1338 1254.5458 1284.7168 1295.3394 1305.7468 1331.8312 1342.6633 1390.7944 1392.0501 1426.3845 1427.4894 1452.3697 1455.4280 1460.7090 1466.2029 1474.0766 1477.0396 1480.8900 1666.8838 1667.1241 2958.8864 2960.6885 2963.5470 2965.4881 2988.0837 3024.4585 3035.4317 3037.9927 3039.3417 3046.5387 3083.9560 3084.9581 3085.8311 3086.4062 3188.3766 3189.8118
redmass: 2.7843 2.9817 3.0980 2.3588 2.4086 1.1613 1.1456 2.1385 2.5746 2.0322 1.8659 2.0742 2.1951 2.1884 2.2882 1.1592 1.0770 2.1754 2.6323 1.7215 2.4375 1.8131 1.3255 1.3268 1.4070 1.3526 1.6607 1.4443 1.4251 1.6247 1.8773 3.0750 1.1881 1.1644 1.2459 2.5353 1.9484 1.4388 1.4954 1.4900 1.2392 1.2439 1.1746 1.1653 1.0710 1.0818 1.0885 1.0577 1.0662 1.0736 1.0727 4.9439 4.9661 1.0610 1.0544 1.0456 1.0396 1.0610 1.0999 1.0965 1.0964 1.0971 1.0991 1.0974 1.0952 1.0645 1.0640 1.1140 1.1139
irintensity: 0.0356 0.0229 0.0016 0.2065 0.0016 0.9636 0.6241 1.2029 0.5729 0.8358 2.1197 1.2582 0.0044 24.6611 0.1397 1.1561 1.1851 4.8161 0.0142 2.9525 0.4548 0.6808 157.3246 2.6582 0.0124 0.7314 2.7824 3.9186 5.8744 7.2748 1.7787 1.1877 1.8585 0.3863 3.7341 16.6432 0.2728 4.6477 0.1253 0.2908 28.5929 21.8201 2.6354 0.5620 4.4759 3.6131 6.7454 46.8935 16.6040 11.6391 6.6672 41.2674 2.1233 39.4979 21.3426 27.3754 23.2037 60.0119 4.0422 27.4051 35.1228 30.5789 76.3873 28.4218 29.6344 5.1415 6.7365 57.9919 0.6929
temp: 298.150 k
press: 1.00000 atm
elementType: 6 6 6 6 6 6 6 6 6 1 1 1 1 1 1 1 1 1 1 1 1 1 1 1 1
symmnumber: 1
zpe: 584560.2 jmol-1
zpe.correction: 0.222647 hartree
zpe.thermalcorrener: 0.233256 hartree
zpe.thermalcorrenthalpy: 0.234200 hartree
zpe.thermalcorrgfe: 0.186219 hartree
zpe.sumelectzpe: -351.787682 hartree
zpe.sumelectthermal: -351.777074 hartree
zpe.sumelectthermalent: -351.776130 hartree
zpe.sumelectthermalfe: -351.824111 hartree
dipole: 0.0160 -1.2185 0.0076
dipole: 1.2187
quadrupole: -56.8467 -56.5152 -59.1953
quadrupole: 0.0002 3.0750 0.0589
quadrupole: 0.6724 1.0038 -1.6762 0.0002 3.0750 0.0589
hfenergy: -352.0103295 hartree
pointgroup: C01 [X(C9H16)]
dipole: -0.007802 -0.4793278 -0.0079712 debye
dipolederiv: 0.1414145 -0.0048766 0.0140597 0.0000107 0.1246962 0.0011823 -0.0429472 0.0032607 0.089941 0.0048008 -0.0210012 -0.0269661 -0.0556697 0.0000784 0.0090746 -0.0479908 0.0510718 0.0569371 -0.0063902 0.0287808 -0.0259116 0.060036 0.0038244 -0.0141037 -0.0386881 -0.0585662 0.0615582 0.167303 -0.0291599 0.1725718 0.0026969 0.2996092 -0.0329699 0.2601638 -0.0079514 0.0158881 0.1922275 0.0313769 0.169614 -0.0057797 0.2976254 0.0347106 0.2557947 0.008083 -0.0048363 -0.0408239 0.0307162 -0.09007 0.0568275 -0.0325421 0.0661296 -0.1290706 0.0516841 0.005866 -0.0571281 -0.0323516 -0.0906097 -0.0544755 -0.0274939 -0.0599661 -0.127403 -0.0425211 0.0168613 -0.1764889 -0.0052144 0.2333288 -0.0085887 -0.2501767 0.0249381 0.2369823 0.0256086 -0.2682692 -0.1581651 -0.0069147 0.2263143 0.0011821 -0.2488761 -0.0354934 0.2290063 -0.036452 -0.2869003 -0.0465684 0.1410699 -0.0484883 0.1139797 -0.0477115 0.0796987 -0.0345906 0.099839 -0.0258544 -0.0504521 -0.1366987 -0.0636251 -0.1083592 -0.0256046 -0.0777437 -0.0495165 -0.0992049 -0.0398327 0.0034933 0.0215496 -0.1008975 0.0503818 -0.0337105 0.1063869 -0.0895265 0.0558968 0.009522 -0.0391445 0.0455159 0.0971971 0.0454238 -0.0367544 -0.122174 0.0712619 -0.1186872 -0.0353651 -0.0378943 -0.0516055 0.0974969 -0.0497267 -0.0480391 0.1207149 0.0718722 0.1179058 -0.0252441 -0.001662 -0.0179045 -0.1048489 -0.0496385 -0.0232031 -0.1044232 -0.0942089 -0.0549276 0.0027489 -0.0594945 -0.0530824 -0.0913984 -0.1393409 0.0106221 -0.0736404 -0.089913 -0.034378 0.0549075 0.0493335 0.0954979 0.015219 0.1006548 -0.0409641 -0.0815747 0.0806812 -0.1084779 -0.0022954 0.0490733 -0.0463116 0.1029145 -0.0418705 0.0005472 0.1023588 0.0696787 0.1201035 -0.0295117 -0.0545323 0.0575731 -0.0849226 0.1437732 -0.0003283 0.0743247 -0.083993 0.0361184 0.0600247 0.0400105 -0.096761 0.0177631 -0.1032017 -0.030324 0.0830853 0.0852381 0.1070558 -0.005326 0.0598688 0.0417513 0.0952921 0.0359145 -0.0022754 -0.1097884 0.0588089 -0.1257748 -0.0349691 0.027593 0.0904738 -0.1293382 0.07152 0.0288359 0.0411712 -0.1464587 0.0425998 0.084772 -0.0073035 -0.0913354 -0.1317039 -0.0693446 0.0270664 -0.0358747 -0.1532757 -0.0693671 0.0968648 0.0128575 -0.0890681 -0.1288797 -0.0711354 0.0365011 -0.0337589 -0.1464373 -0.032911 0.093458 -0.0119282 0.0979803 -0.1241114 0.0747303 0.0185975 0.0377355 -0.1454684 0.0699918 0.1090544 unknown
polarizability: 97.184858|0.5508274|113.7105514|8.2205722|0.2912466|73.1105129 unknown
InChI: InChI=1S/C9H16/c1-8(2)6-5-7-9(3)4/h1,3,5-7H2,2,4H3
charge 0 multiplicity 1
25 atoms
C  -0.0097 -1.398205 -0.060077
C  0.94068 -0.525071 -0.928884
C  -0.932214 -0.567343 0.878619
C  1.994979 0.240552 -0.134893
C  -1.987376 0.258233 0.148254
C  2.995409 -0.592611 0.649625
C  -3.055953 -0.51716 -0.605137
C  2.049597 1.600015 -0.14452
C  -1.982788 1.618396 0.183166
H  0.584965 -2.101497 0.555047
H  -0.626226 -2.027794 -0.731052
H  0.334634 0.185789 -1.520971
H  1.455778 -1.193616 -1.650876
H  -1.444537 -1.26983 1.569209
H  -0.304134 0.098976 1.499058
H  3.777621 0.036626 1.10736
H  3.48764 -1.338285 -0.005408
H  2.500389 -1.161305 1.460923
H  -3.815495 0.154716 -1.040043
H  -3.569516 -1.232983 0.066659
H  -2.619583 -1.113922 -1.430035
H  1.32464 2.197043 -0.710405
H  2.820246 2.151016 0.408303
H  -1.210462 2.173291 0.728906
H  -2.749794 2.211568 -0.329728
