program: Gaussian 09
title: 000142868
version: EM64L-G09RevD.01
frameworkgroup: C1[X(C15H11N)]
method: RPBEPBE
basis: SDD
operation: Freq
keyword: #pfreq=noraman
keyword: PBEPBE/SDD
title: #p freq=noraman PBEPBE/SDD
converged: NO YES NO NO
title: Mulliken charges:
elementType: N C C C C C C C C C C C C C C C H H H H H H H H H H H
charge: -0.073458 0.320698 0.320697 0.157628 0.157624 -0.344735 -0.344842 -0.344737 -0.344841 -0.307563 -0.307561 -0.279984 -0.279984 -0.322522 -0.322522 -0.213952 0.234412 0.234445 0.234413 0.234445 0.225521 0.225521 0.217061 0.217061 0.236009 0.236009 0.235155
chargesum: 0.00000
title: Mulliken charges with hydrogens summed into heavy atoms:
elementType: N C C C C C C C C C C C C C C C
charge: -0.073458 0.320698 0.320697 0.157628 0.157624 -0.110323 -0.110398 -0.110324 -0.110396 -0.082041 -0.082040 -0.062924 -0.062924 -0.086513 -0.086513 0.021203
polarizability: 1.91060381e+02 -1.59644465e-05 1.93799535e+02 -3.33563862e-02 3.60617587e-04 1.03253405e+02
1716.lowfreq: -7.5156 -4.6730 -1.4373 -0.0011 -0.0006 -0.0005 30.8775 132.2564 189.3860
frequency: 30.8413 132.2540 189.3858 230.0069 234.3928 248.6222 255.8373 346.0188 362.9863 420.4757 421.9332 444.8106 487.2029 497.0262 521.4566 536.2815 604.6594 644.6848 674.4554 675.7442 712.1032 721.5252 733.4852 738.6147 766.8534 766.9827 774.9536 801.2834 841.6106 870.9057 905.4785 927.6235 938.4351 958.0881 969.4544 971.0574 976.4772 992.4970 1001.1898 1075.5593 1103.0869 1149.9041 1161.7996 1173.4437 1176.7513 1185.4284 1208.2821 1220.0833 1225.7572 1282.0148 1312.4371 1348.3395 1375.9621 1381.7731 1384.1471 1396.8244 1429.9277 1483.2342 1541.3717 1543.0491 1543.2796 1583.3531 1599.8147 1600.6008 3081.2190 3081.6255 3109.6292 3110.6421 3118.8334 3120.2880 3127.3603 3137.9668 3141.9237 3148.2444 3160.7268
redmass: 4.2201 3.9113 4.4216 7.1240 6.3294 3.1065 3.0577 2.8147 4.9295 3.4009 4.4261 2.4477 7.2566 6.0265 3.1230 3.7967 5.2818 4.2977 3.4326 4.8319 1.5615 4.5631 2.9916 1.4968 1.7664 4.3303 1.3585 2.5838 2.5588 3.3870 1.4616 1.4495 1.3837 6.8755 1.3123 1.3321 3.5495 1.3573 2.7801 1.8007 1.4004 1.9003 1.4918 1.5359 1.1092 1.4811 2.1584 1.3125 1.9221 1.2593 7.0892 3.7082 4.3444 1.4971 4.5154 1.6734 2.1785 2.7946 7.1886 7.2725 4.7155 5.9972 7.4068 7.1065 1.0839 1.0840 1.0961 1.0959 1.0865 1.0867 1.0869 1.0925 1.0966 1.0979 1.0998
irintensity: 0.0429 0.0000 8.3488 0.0283 0.2199 7.8217 0.0000 0.0000 1.2963 1.2317 0.1238 0.0000 0.0052 1.0573 0.0209 16.8938 0.0000 9.9013 0.0000 5.0350 61.5752 21.1569 23.1293 26.0587 0.0536 2.9647 0.2046 37.4266 85.1697 69.4937 0.0000 13.9129 0.0002 1.8695 3.5099 0.0000 1.0708 1.5122 0.0249 9.8897 11.3441 2.3306 0.4710 3.1352 6.4987 0.9721 0.3814 8.0409 1.7902 0.0000 0.2622 0.0074 1.7638 7.7380 3.3726 0.6618 46.6074 0.8523 0.0002 25.6801 14.3427 34.5595 0.0122 0.2454 6.0035 0.2616 96.0719 4.2551 0.0000 13.4474 0.2779 24.9523 30.9544 5.4311 28.4821
temp: 298.150 k
press: 1.00000 atm
elementType: 7 6 6 6 6 6 6 6 6 6 6 6 6 6 6 6 1 1 1 1 1 1 1 1 1 1 1
symmnumber: 1
zpe: 551193.6 jmol-1
zpe.correction: 0.209939 hartree
zpe.thermalcorrener: 0.221416 hartree
zpe.thermalcorrenthalpy: 0.222361 hartree
zpe.thermalcorrgfe: 0.172679 hartree
zpe.sumelectzpe: -631.793024 hartree
zpe.sumelectthermal: -631.781546 hartree
zpe.sumelectthermalent: -631.780601 hartree
zpe.sumelectthermalfe: -631.830283 hartree
dipole: -3.0379 0.0000 -0.0005
dipole: 3.0379
quadrupole: -89.1576 -79.1219 -91.7362
quadrupole: 0.0000 -0.0130 0.0002
quadrupole: -2.4857 7.5500 -5.0643 0.0000 -0.0130 0.0002
hfenergy: -632.0029621 hartree
pointgroup: C01 [X(C15H11N1)]
dipole: -1.1951849 -0.0000977 -0.0001796 debye
polarizability: 191.0603814|-0.0002362|193.799535|-0.0333564|0.0003579|103.2534053 unknown
InChI: InChI=1S/C15H11N/c1-2-14-10-8-12-4-6-13(7-5-12)9-11-15(3-1)16-14/h1-11H
charge 0 multiplicity 1
27 atoms
N  -0.614139 -0.000046 -0.000782
C  1.735422 1.396966 0.000485
C  1.735658 -1.396668 0.000474
C  -1.283602 1.192809 -0.000352
C  -1.283401 -1.193009 -0.000356
C  1.961654 0.705466 -1.218749
C  1.959417 0.705457 1.220125
C  1.961775 -0.705126 -1.218756
C  1.959529 -0.705127 1.220118
C  0.860252 2.612271 -0.000255
C  0.860687 -2.612118 -0.00028
C  -0.508133 2.463117 -0.000554
C  -0.507723 -2.46319 -0.000576
C  -2.710546 1.223195 0.00028
C  -2.710344 -1.223631 0.000289
C  -3.417582 -0.000277 0.000553
H  1.911672 1.244529 -2.171948
H  1.907756 1.244534 2.173227
H  1.91189 -1.244191 -2.171959
H  1.907955 -1.24422 2.173215
H  1.278219 3.629493 -0.000638
H  1.278821 -3.629271 -0.000712
H  -1.125445 3.373279 -0.000989
H  -1.124887 -3.373452 -0.001027
H  -3.246891 2.178608 0.000569
H  -3.246532 -2.179132 0.000589
H  -4.512783 -0.000367 0.001007
