program: Gaussian 09
title: 000142866
version: EM64L-G09RevD.01
frameworkgroup: C1[X(C8H6IN)]
method: RPBEPBE
basis: SDD
operation: Freq
keyword: #pfreq=noraman
keyword: PBEPBE/SDD
title: #p freq=noraman PBEPBE/SDD
converged: YES YES NO NO
title: Mulliken charges:
elementType: I N C C C C C C C C H H H H H H
charge: 0.114364 -0.007661 0.467615 -0.591438 -0.360157 -0.360330 -0.152986 -0.152995 -0.347203 -0.122394 0.259005 0.259026 0.244132 0.244110 0.253457 0.253454
chargesum: 0.00000
title: Mulliken charges with hydrogens summed into heavy atoms:
elementType: I N C C C C C C C C
charge: 0.114364 -0.007661 0.467615 -0.073406 -0.116025 -0.116220 0.100471 0.100459 -0.347203 -0.122394
polarizability: 1.75281235e+02 3.67563152e-03 8.80539835e+01 -3.14552857e+00 2.08868443e-02 5.81815064e+01
1716.lowfreq: -23.2557 -11.1370 0.0003 0.0005 0.0006 4.5317 5.5713 52.8647 131.5954
frequency: -21.6117 52.8474 131.5944 177.3377 231.0734 293.9934 334.7116 352.0494 402.6103 438.9511 503.9514 624.2294 626.0802 716.5608 785.3863 835.5890 841.8778 911.2370 925.6474 960.3312 971.8116 992.5982 1055.4601 1111.9537 1181.5223 1193.9594 1202.9202 1295.2364 1300.0088 1369.7951 1390.9194 1450.1478 1471.3938 1580.0384 1596.1910 2198.9296 3002.5724 3057.0044 3133.5252 3135.4736 3167.5859 3170.9853
redmass: 4.7486 11.0167 8.5832 4.6403 10.2071 6.7336 2.7461 3.4966 2.8289 6.4192 3.6793 6.8833 5.1173 3.9058 2.8307 1.2490 2.0064 1.8074 3.7219 1.4343 1.3848 5.7055 2.5678 1.4150 1.1116 1.1151 2.5355 1.4909 1.2699 7.4651 2.5060 1.1187 2.2061 7.1741 6.0907 12.4221 1.0592 1.1008 1.0900 1.0900 1.0955 1.0966
irintensity: 3.7089 2.4036 1.3860 1.2550 4.1501 0.3239 0.5320 0.0939 0.0087 11.0688 20.9499 0.1298 7.7439 1.9957 41.7767 0.0033 50.5549 0.0001 1.3392 0.0361 0.0270 62.7247 18.1955 6.0854 0.8031 0.2719 0.5644 0.6920 0.2884 0.1572 10.0437 33.5965 61.5539 0.0001 13.8564 9.5019 9.2244 2.1929 6.2309 9.2801 9.6813 0.2026
temp: 298.150 k
press: 1.00000 atm
elementType: 53 7 6 6 6 6 6 6 6 6 1 1 1 1 1 1
symmnumber: 1
zpe: 300119.7 jmol-1
zpe.correction: 0.114310 hartree
zpe.thermalcorrener: 0.122728 hartree
zpe.thermalcorrenthalpy: 0.123672 hartree
zpe.thermalcorrgfe: 0.078657 hartree
zpe.sumelectzpe: -373.991175 hartree
zpe.sumelectthermal: -373.982757 hartree
zpe.sumelectthermalent: -373.981813 hartree
zpe.sumelectthermalfe: -374.026827 hartree
dipole: -0.7252 0.0075 -3.4128
dipole: 3.4890
quadrupole: -86.1636 -64.6726 -79.3823
quadrupole: 0.0391 -18.2760 0.0224
quadrupole: -9.4241 12.0669 -2.6428 0.0391 -18.2760 0.0224
hfenergy: -374.1054847 hartree
pointgroup: C01 [X(C8H6I1N1)]
dipole: -0.4267281 0.0037044 -1.3046637 debye
dipolederiv: -0.524917 -0.0003689 0.1170276 -0.0004748 -0.01873 0.0000873 0.1288259 -0.0000059 -0.0240534 -0.300896 -0.0000167 0.0050943 0.0004556 -0.2236356 -0.0000622 -0.1437337 -0.0000644 -0.2078908 0.3171308 0.00004 -0.0152262 0.0000728 -0.0141885 0.0003075 -0.0327228 0.0002899 -0.1117976 0.136669 0.0002635 -0.078141 0.0004297 0.2214802 0.0002683 -0.0930682 0.0002688 0.1174588 -0.0486711 -0.077359 -0.0461351 0.0609197 0.0531108 -0.0083287 -0.0226471 0.0054441 -0.125585 -0.0487533 0.077496 -0.0458157 -0.060736 0.0531113 0.0088862 -0.0229382 -0.0047999 -0.1256048 -0.4396262 0.1352802 0.075958 0.0076144 0.0422302 -0.0008295 0.0837801 -0.036585 -0.0974768 -0.4395799 -0.1357602 0.075382 -0.0080464 0.0419868 0.0012169 0.0837369 0.0371188 -0.097326 1.2068548 0.0009362 -0.324189 0.0011883 -0.0368596 -0.0000199 -0.3428819 0.0000759 -0.0852549 -0.0521823 -0.0003986 0.1303032 -0.000796 -0.0500611 -0.0003074 0.2434506 -0.0003107 0.0655121 0.0290559 -0.0103798 -0.013466 -0.058902 0.0016552 0.0986842 -0.0086295 0.0385904 0.0539483 0.0288906 0.0104921 -0.013302 0.0589148 0.0024903 -0.0989305 -0.0082598 -0.0388177 0.0531662 0.0068164 0.0903524 0.0459066 0.0815309 -0.0267348 -0.015392 0.0399579 -0.0223651 0.1383448 0.0067966 -0.0905493 0.0455934 -0.08184 -0.0270054 0.0148531 0.0396301 0.0217732 0.1385131 0.0611797 -0.0709597 0.0204066 -0.0641999 -0.009524 0.0138933 0.0276192 0.016617 0.1540709 0.0612319 0.0709318 0.0206034 0.0638687 -0.0093259 -0.0143267 0.0278805 -0.0172297 0.1539752 unknown
polarizability: 173.2860113|0.041904|88.0539596|-15.4774572|0.0349613|60.1767536 unknown
InChI: InChI=1S/C8H6IN/c9-8-3-1-7(2-4-8)5-6-10/h1-4H,5H2
charge 0 multiplicity 1
16 atoms
I  -4.216635 -0.002283 0.67422
N  3.69965 -0.003313 1.201079
C  0.610616 0.001695 -0.556743
C  2.094693 0.002825 -0.934751
C  -0.084326 -1.217999 -0.376798
C  -0.08507 1.220244 -0.372033
C  -1.452861 -1.228446 -0.024059
C  -1.45363 1.22847 -0.019252
C  -2.127857 -0.000532 0.150506
C  2.985775 -0.000552 0.245146
H  2.338999 0.892205 -1.545122
H  2.339033 -0.883072 -1.550162
H  0.438296 -2.172636 -0.508544
H  0.436961 2.175711 -0.500047
H  -1.978101 -2.178327 0.109068
H  -1.979444 2.17751 0.117593
