program: Gaussian 09
title: 000142859
version: EM64L-G09RevD.01
frameworkgroup: C1[X(C9H7ClN2)]
method: RPBEPBE
basis: SDD
operation: Freq
keyword: #p
keyword: freq=noraman
keyword: PBEPBE/SDD
title: #p freq=noraman PBEPBE/SDD
converged: NO NO NO NO
title: Mulliken charges:
elementType: Cl N N C C C C C C C C C H H H H H H H
charge: -0.043968 -0.227024 -0.082806 0.497849 -0.334922 -0.319746 -0.159239 -0.200693 -0.208799 -0.208611 -0.121541 -0.333638 0.235471 0.234672 0.248803 0.250725 0.258723 0.259063 0.255680
chargesum: 0.00000
title: Mulliken charges with hydrogens summed into heavy atoms:
elementType: Cl N N C C C C C C C C C
charge: -0.043968 -0.227024 -0.082806 0.497849 -0.099450 -0.085074 0.089564 0.050032 0.049924 0.050452 -0.121541 -0.077959
polarizability: 2.00851387e+02 9.40329893e-01 1.10340572e+02 -6.65723858e-03 1.36680767e-03 4.50711388e+01
1716.lowfreq: -66.8681 -6.1397 -2.6601 0.0014 0.0020 0.0023 5.9321 66.8368 144.7691
frequency: -66.8640 66.8284 144.7663 176.6421 281.1435 284.5789 329.2885 401.8551 442.1069 496.2320 504.4581 614.4657 625.5023 643.3201 697.7801 707.5477 715.6427 765.6686 809.3937 824.9727 850.3896 874.9622 942.2210 946.9298 953.4887 995.2913 1030.3337 1076.3680 1095.1750 1108.1855 1121.9978 1198.5770 1231.9426 1247.7870 1288.5221 1309.8357 1355.9867 1372.6689 1414.2600 1438.2757 1481.3148 1496.5658 1588.9757 1610.7591 3158.9250 3159.2753 3176.6148 3180.2322 3231.2007 3253.0397 3267.1220
redmass: 3.3707 8.8327 7.2239 6.7620 9.9262 6.7195 5.3573 2.8730 4.3269 8.1279 2.7974 2.6486 7.1873 2.7836 2.4598 1.6067 7.0743 1.6721 1.2645 1.6106 1.4120 6.3343 1.3561 6.3247 1.3680 3.8373 2.0412 3.6499 2.3889 1.5923 1.4980 1.1693 3.4356 1.3099 2.2441 1.3134 5.4548 7.3403 3.3366 3.0724 4.1561 2.8091 7.6480 6.2800 1.0883 1.0883 1.0967 1.0976 1.0927 1.0963 1.1079
irintensity: 1.1684 1.4786 2.7827 0.2565 0.1193 0.5999 0.3535 0.0006 0.8290 26.4858 26.8224 2.1283 0.1278 13.8250 5.9011 19.7907 8.5763 57.4480 0.1639 109.6878 2.8042 7.6394 0.2959 32.3382 0.0019 15.6920 59.9904 29.4119 13.4350 17.2675 21.4198 2.9707 10.4820 47.4309 128.3506 1.5062 0.0976 1.1335 5.4754 46.5119 5.4390 286.4282 0.4529 11.9260 6.8625 3.2554 6.4502 1.7542 3.3079 0.6558 1.5043
temp: 298.150 k
press: 1.00000 atm
elementType: 17 7 7 6 6 6 6 6 6 6 6 6 1 1 1 1 1 1 1
symmnumber: 1
zpe: 364797.7 jmol-1
zpe.correction: 0.138944 hartree
zpe.thermalcorrener: 0.147669 hartree
zpe.thermalcorrenthalpy: 0.148614 hartree
zpe.thermalcorrgfe: 0.104242 hartree
zpe.sumelectzpe: -915.869912 hartree
zpe.sumelectthermal: -915.861187 hartree
zpe.sumelectthermalent: -915.860243 hartree
zpe.sumelectthermalfe: -915.904615 hartree
dipole: -1.5983 1.3753 0.0032
dipole: 2.1086
quadrupole: -97.4573 -64.9343 -81.3078
quadrupole: 8.0984 0.0166 -0.0023
quadrupole: -16.2242 16.2989 -0.0747 8.0984 0.0166 -0.0023
hfenergy: -916.0088564 hartree
pointgroup: C01 [X(C9H7Cl1N2)]
dipole: 0.6325603 0.5367368 -0.0012408 debye
dipolederiv: -0.9327488 0.006565 0.0000329 0.0070104 -0.116584 -0.000071 0.000064 -0.0000465 -0.05863 -1.526949 -0.0302094 0.0002525 -0.1030638 -0.0908745 -0.0000347 0.0008648 0.0001458 0.0170817 -0.8695978 -0.0237536 0.0000583 0.3192108 -0.2331772 0.0000217 -0.0010027 -0.000072 -0.2588229 1.4205348 -0.0037579 -0.0000747 -0.0023743 0.0126234 0.0003003 -0.0003051 0.0000397 0.0841612 -0.1936789 -0.00132 -0.0000414 -0.1898277 0.0182428 0.0003097 0.0000255 0.0002979 -0.1602623 -0.2051758 -0.0003892 0.0001434 0.1765899 0.0216903 0.0002986 0.0000329 0.000247 -0.1465391 0.4369953 -0.059825 -0.000123 -0.4112696 -0.0876216 -0.0003077 -0.0003298 -0.000246 -0.1829972 0.8703654 0.1651872 -0.0003841 0.4896312 0.0839988 -0.0006366 -0.0002391 -0.0003478 -0.1111454 -0.2481489 0.0229128 0.0000362 0.116544 0.0563546 0.0001597 0.0001668 0.0001836 -0.0976624 -0.2272161 -0.0202561 0.0000098 -0.0900249 0.0574847 0.0001761 -0.0001243 0.0002008 -0.0965569 1.2588953 -0.0092911 -0.0000504 -0.0259584 0.0348862 0.0001035 -0.0001275 0.0000802 -0.0810579 -0.1515909 -0.1211971 0.0001876 -0.3733763 0.1480531 -0.000482 0.0009493 -0.0005835 -0.1754451 0.0395763 0.0927253 0.0001339 0.0947145 -0.010105 -0.0002682 0.0002362 -0.0002122 0.1639181 0.0357119 -0.0941999 -0.0001562 -0.0881886 -0.0032117 -0.0002531 -0.000227 -0.0001942 0.162083 0.1006634 -0.0954099 0.0002533 -0.0498528 0.0216552 0.0004596 0.0001885 0.0003859 0.2218026 0.0817843 0.0819428 -0.000134 0.0715703 0.0298189 0.0003515 -0.0001778 0.0002274 0.1945532 0.0518231 -0.0603474 -0.0000722 -0.0632666 0.0029381 -0.0001862 -0.0000804 -0.0001684 0.1651071 0.0547661 0.0591442 0.000071 0.0615963 0.0022786 -0.0001917 0.000091 -0.0001845 0.1646416 0.0039901 0.0914793 -0.0001431 0.0603356 0.0515494 0.0002506 -0.0000052 0.0002467 0.1957709 unknown
polarizability: 200.8340815|-1.565314|110.3578773|-0.0066665|-0.0013208|45.0711388 unknown
InChI: InChI=1S/C9H7ClN2/c10-8-1-3-9(4-2-8)12-6-5-11-7-12/h1-7H
charge 0 multiplicity 1
19 atoms
Cl 4.643286 -0.024921 -0.000145
N  -1.429718 0.020806 -0.000057
N  -3.581679 -0.735219 0.001644
C  0.003556 0.010471 -0.00009
C  0.732787 1.226948 0.001243
C  0.714372 -1.217634 -0.001443
C  -2.268584 1.155423 -0.001929
C  -2.287481 -1.095231 0.002206
C  2.142053 1.219548 0.001234
C  2.122943 -1.231327 -0.001374
C  2.825592 -0.010969 -0.000066
C  -3.573544 0.673035 -0.00071
H  0.216923 2.190871 0.002569
H  0.18414 -2.173865 -0.002774
H  -1.889354 2.171707 -0.00428
H  -1.934491 -2.121529 0.004247
H  2.69655 2.16243 0.002305
H  2.662894 -2.182644 -0.002455
H  -4.499644 1.242901 -0.001624
