program: Gaussian 09
title: 000142858
version: EM64L-G09RevD.01
frameworkgroup: C1[X(C9H7ClN2)]
method: RPBEPBE
basis: SDD
operation: Freq
keyword: #p
keyword: freq=noraman
keyword: PBEPBE/SDD
title: #p freq=noraman PBEPBE/SDD
converged: NO YES NO NO
title: Mulliken charges:
elementType: Cl N N C C C C C C C C C H H H H H H H
charge: -0.018501 -0.233055 -0.084552 0.557344 -0.306935 -0.339910 -0.191438 -0.224318 -0.208742 -0.218964 -0.226333 -0.312866 0.262811 0.280241 0.268834 0.260337 0.240028 0.241360 0.254661
chargesum: 0.00000
title: Mulliken charges with hydrogens summed into heavy atoms:
elementType: Cl N N C C C C C C C C C
charge: -0.018501 -0.233055 -0.084552 0.557344 -0.306935 -0.077099 0.088803 0.044517 0.051594 0.021064 0.015027 -0.058205
polarizability: 1.60526180e+02 9.10582726e+00 1.19239032e+02 -3.90396475e-02 6.35112770e+00 6.02944521e+01
1716.lowfreq: 0.0021 0.0031 0.0032 4.0743 5.3630 9.1637 54.4422 89.4256 109.0916
frequency: 54.3884 89.4198 109.0902 173.1801 227.4722 310.0892 321.9232 415.7999 451.4021 472.7343 544.5789 628.5493 641.8125 653.0897 707.0906 718.7050 730.2110 763.7454 778.5980 847.8514 865.9020 876.1371 948.4987 949.4358 987.1964 1021.2640 1028.2400 1045.1094 1092.0783 1106.6690 1125.4379 1174.0063 1225.2079 1230.6437 1268.3164 1288.0085 1356.1594 1371.9079 1426.4226 1439.7084 1469.9458 1488.5621 1575.8653 1604.6128 3143.2154 3154.1728 3167.4160 3180.0409 3231.5901 3237.1210 3265.9586
redmass: 4.8509 5.0941 5.3693 5.5033 8.3357 5.4513 6.4883 6.9780 3.6897 5.0663 3.7966 3.5000 6.3473 3.5616 6.4202 3.6842 1.2909 1.2529 1.3700 1.4045 1.3758 6.3421 4.5009 1.5044 1.3295 4.4473 2.8617 1.8176 2.0266 2.1210 1.6446 1.0566 2.3834 1.4048 2.0486 1.9675 5.4403 5.8799 2.4828 2.9815 3.7955 3.8779 6.5709 7.1797 1.0861 1.0907 1.0953 1.1005 1.0925 1.0978 1.1087
irintensity: 2.3039 0.0118 0.2322 0.7448 0.5498 1.8140 1.7181 3.5237 8.4782 2.2856 2.5037 3.6620 6.9109 23.0848 13.8592 0.3427 27.9840 114.6396 44.2343 3.3186 0.5629 10.9805 12.0143 2.1312 0.0317 48.8047 21.2859 36.2562 9.3727 13.9961 6.1180 0.0217 4.2167 17.7705 13.0284 40.5859 0.4402 0.5999 19.2513 51.3614 43.2612 123.3198 4.2664 17.1349 1.0462 7.7961 7.2035 9.8500 4.7008 0.4156 1.0887
temp: 298.150 k
press: 1.00000 atm
elementType: 17 7 7 6 6 6 6 6 6 6 6 6 1 1 1 1 1 1 1
symmnumber: 1
zpe: 364768.8 jmol-1
zpe.correction: 0.138933 hartree
zpe.thermalcorrener: 0.148496 hartree
zpe.thermalcorrenthalpy: 0.149440 hartree
zpe.thermalcorrgfe: 0.102861 hartree
zpe.sumelectzpe: -915.866695 hartree
zpe.sumelectthermal: -915.857132 hartree
zpe.sumelectthermalent: -915.856188 hartree
zpe.sumelectthermalfe: -915.902767 hartree
dipole: -4.6466 -0.8215 1.2587
dipole: 4.8836
quadrupole: -79.0038 -72.2006 -78.1449
quadrupole: 7.1601 4.8015 1.8489
quadrupole: -2.5541 4.2492 -1.6951 7.1601 4.8015 1.8489
hfenergy: -916.005628 hartree
pointgroup: C01 [X(C9H7Cl1N2)]
dipole: -1.8421943 -0.1909174 0.5113803 debye
dipolederiv: -0.1805668 -0.1958365 0.0625363 -0.1952413 -0.5872617 0.1437734 0.0417168 0.1349298 -0.0743215 -1.2438968 0.0423732 -0.0010179 0.0771869 -0.0920203 0.0300576 0.0649692 0.0143664 -0.0278948 -0.7917476 0.0639909 0.0103989 -0.0011257 -0.2395889 -0.0072514 -0.1328913 0.0138114 -0.2638079 1.0669931 -0.1193989 0.039574 0.0279343 -0.1212239 -0.0280783 0.0308131 -0.0101329 0.0530111 0.0385111 0.3719553 -0.1014011 0.3357605 0.8350061 -0.2428346 -0.0559313 -0.2124967 -0.0188607 -0.1399475 0.0345082 -0.0004196 -0.148343 -0.0038533 -0.0422448 -0.0071236 -0.0283471 -0.1278468 0.3564891 -0.0123359 0.0349924 0.3383562 -0.0889098 0.051608 0.1761278 -0.0122724 -0.1248012 0.7644703 -0.1653159 -0.0780913 -0.5077462 0.0277841 0.0937912 -0.1936076 0.1105257 0.0042195 -0.0683434 -0.148159 0.0341181 -0.1064115 -0.1460011 0.020796 0.0422456 0.0124449 -0.0959618 -0.0243236 0.0525035 -0.0039277 0.065732 0.076227 -0.0417785 -0.0440287 -0.0470688 -0.1351221 0.0512163 -0.0104467 0.003436 0.0100958 -0.0031106 -0.0309852 -0.0028185 -0.0291842 -0.1460306 -0.0139874 0.1073178 0.0761582 0.1207683 -0.013875 0.1516302 0.1250919 0.1352011 -0.0630917 0.0358619 0.0736602 -0.0189869 0.0731874 0.0143764 0.0406629 -0.0197206 0.0269889 0.1438254 0.0961137 0.0609788 0.0464842 0.0310515 0.093383 -0.0906325 0.0291538 -0.0641117 0.148278 0.0627456 -0.0556328 -0.0455522 -0.0362836 0.1008446 -0.0766609 -0.0515073 -0.0677269 0.12054 0.053872 0.0492227 -0.0106767 0.0690799 0.0075418 0.0335648 -0.0172509 0.0314716 0.1560165 0.0425458 -0.0638783 0.013423 -0.0808647 -0.0495835 0.0462631 0.0236433 0.0451268 0.1537578 -0.0990925 -0.0192761 0.0031796 -0.0152642 0.0811596 0.0192008 0.0030039 0.0132696 0.1619006 -0.0069132 -0.0662304 -0.0642273 -0.0578726 0.1091055 -0.0708819 -0.0118853 -0.0667955 0.1361903 unknown
polarizability: 161.1546185|7.5092604|119.2802007|-0.0973516|-1.0086108|59.6248446 unknown
InChI: InChI=1S/C9H7ClN2/c10-8-3-1-2-4-9(8)12-6-5-11-7-12/h1-7H
charge 0 multiplicity 1
19 atoms
Cl -0.466141 2.575636 -0.624364
N  1.054381 -0.120371 0.005679
N  3.186591 -0.757721 -0.45835
C  -0.375033 -0.171949 0.026023
C  -1.19736 0.956832 -0.22383
C  -1.008506 -1.414913 0.289593
C  1.90198 0.745935 0.724486
C  1.890102 -1.01352 -0.689089
C  -2.602305 0.859702 -0.202924
C  -2.41342 -1.527759 0.293486
C  -3.213671 -0.387596 0.054137
C  3.200454 0.335782 0.429398
H  -0.37802 -2.283082 0.508073
H  1.514995 1.536864 1.358905
H  1.496185 -1.778494 -1.353917
H  -3.206755 1.749704 -0.399694
H  -2.879683 -2.496732 0.497767
H  -4.305682 -0.461652 0.065216
H  4.136288 0.750333 0.796007
