program: Gaussian 09
title: 000142850
version: EM64L-G09RevD.01
frameworkgroup: C1[X(C10H16OSi)]
method: RPBEPBE
basis: SDD
operation: Freq
keyword: #p
keyword: freq=noraman
keyword: PBEPBE/SDD
title: #p freq=noraman PBEPBE/SDD
converged: YES YES NO NO
title: Mulliken charges:
elementType: Si O C C C C C C C C C C H H H H H H H H H H H H H H H H
charge: 1.405788 -0.598397 -0.228397 -1.036061 -1.036308 -0.293077 -0.303484 0.431411 -0.380321 -0.389690 -0.487492 -0.807499 0.254292 0.239375 0.232911 0.239407 0.254239 0.232955 0.276279 0.217784 0.227206 0.227027 0.231199 0.203973 0.203965 0.224859 0.234748 0.223307
chargesum: 0.00000
title: Mulliken charges with hydrogens summed into heavy atoms:
elementType: Si O C C C C C C C C C C
charge: 1.405788 -0.598397 -0.228397 -0.309483 -0.309707 -0.016798 -0.085700 0.431411 -0.153115 -0.162662 0.151644 -0.124584
polarizability: 1.78565360e+02 3.06284433e+00 1.30857000e+02 5.69943258e-01 -2.64872965e-02 9.14592716e+01
1716.lowfreq: -24.4760 -9.9864 -8.1079 -0.0023 -0.0023 -0.0021 5.9366 27.7551 49.6376
frequency: -23.0907 27.7157 49.5909 70.3227 77.0308 99.6587 111.9025 122.7144 147.4302 155.4719 183.3952 242.0933 244.2433 261.3193 323.9829 353.6521 388.1467 396.2710 499.9119 563.9076 628.7680 634.3326 686.8649 694.7611 724.3018 789.6684 791.2177 805.0634 829.9095 862.4464 883.5722 901.7758 954.2585 984.8886 990.3363 1014.2530 1046.6715 1049.8077 1109.8345 1118.6730 1118.7050 1148.0447 1198.7257 1222.9213 1293.7239 1300.5374 1305.2464 1350.0702 1394.1394 1395.5837 1437.5095 1439.8376 1440.9239 1449.0079 1451.9309 1468.8288 1471.6437 1472.7232 1474.9858 1492.2099 1566.2704 1613.7377 2928.7693 2973.6296 2981.4294 2982.8301 3006.0051 3054.8635 3072.2391 3079.2642 3081.7968 3083.8316 3094.6870 3094.9290 3095.8193 3114.9888 3126.7551 3148.5356
redmass: 1.0251 3.4915 2.9742 3.1549 3.5137 1.0355 1.0122 1.3024 1.7558 3.3077 2.5736 4.1521 4.4542 3.7017 4.0127 2.8188 4.6174 2.8186 2.6780 5.0228 4.8576 6.3439 4.7039 2.6623 3.0955 1.6704 2.3481 1.4320 1.6723 1.2528 1.6099 1.4768 1.3286 1.4142 1.3535 3.4008 1.6591 5.2844 3.8376 1.2723 1.3673 1.4216 1.1176 2.7854 1.2060 1.2224 1.2879 4.0217 3.2509 1.2262 1.0513 1.0930 1.0560 1.0631 1.0646 1.0925 1.0515 1.0539 1.0522 2.4207 5.5409 6.1760 1.0330 1.0386 1.0347 1.0344 1.1028 1.0948 1.0982 1.0978 1.0972 1.0997 1.0926 1.0986 1.0931 1.0889 1.0957 1.0956
irintensity: 0.5607 0.1597 6.9574 0.1596 1.9457 0.0046 0.0296 1.0951 1.4722 0.1923 0.7550 16.3081 3.0440 1.1018 4.6566 2.1480 22.9992 0.1426 33.3242 2.9558 12.3482 2.7157 39.7825 17.7932 0.2511 1.1093 1.8372 121.7808 19.9659 0.9059 175.5836 102.0059 0.1369 2.8517 0.5220 2.5342 47.2628 205.7192 55.1262 0.4984 2.7717 27.9442 4.0037 0.1858 50.2735 18.0943 19.8862 3.5059 4.1040 10.7112 2.7616 3.1249 0.0398 7.2586 14.9092 16.8696 11.8512 12.7863 7.2332 11.7034 0.5929 16.7557 111.4429 38.6463 7.2476 15.4408 67.3388 24.5310 44.2052 0.0595 37.5312 19.7444 0.5758 8.3274 31.2170 21.6987 30.3596 8.4190
temp: 298.150 k
press: 1.00000 atm
elementType: 14 8 6 6 6 6 6 6 6 6 6 6 1 1 1 1 1 1 1 1 1 1 1 1 1 1 1 1
symmnumber: 1
zpe: 605596.6 jmol-1
zpe.correction: 0.230660 hartree
zpe.thermalcorrener: 0.245611 hartree
zpe.thermalcorrenthalpy: 0.246555 hartree
zpe.thermalcorrgfe: 0.187530 hartree
zpe.sumelectzpe: -754.393004 hartree
zpe.sumelectthermal: -754.378053 hartree
zpe.sumelectthermalent: -754.377109 hartree
zpe.sumelectthermalfe: -754.436134 hartree
dipole: -0.6528 -1.0278 0.0638
dipole: 1.2192
quadrupole: -66.2303 -76.6440 -84.3684
quadrupole: 0.0443 0.2617 -0.0023
quadrupole: 9.5173 -0.8964 -8.6208 0.0443 0.2617 -0.0023
hfenergy: -754.6236638 hartree
pointgroup: C01 [X(C10H16O1Si1)]
dipole: 0.2461409 -0.4109916 -0.0244026 debye
polarizability: 178.3732827|-4.304454|131.049601|0.5292323|-0.065232|91.4587485 unknown
InChI: InChI=1S/C10H16OSi/c1-9-5-7-10(8-6-9)12(3,4)11-2/h5-8H,1-4H3
charge 0 multiplicity 1
28 atoms
Si 1.840218 -0.485689 0.002289
O  2.451805 1.153749 -0.006284
C  -0.040725 -0.219884 0.006253
C  2.436957 -1.398297 1.569332
C  2.426566 -1.411895 -1.560659
C  -0.586141 1.091948 0.010323
C  -0.945642 -1.315817 0.009092
C  -2.8863 0.202303 0.013751
C  -1.983601 1.296862 0.015933
C  -2.343107 -1.108567 0.014428
C  3.861546 1.509516 -0.011507
C  -4.388706 0.425635 -0.013549
H  2.135871 -0.842784 2.475173
H  1.992156 -2.409309 1.62796
H  3.536669 -1.514267 1.579942
H  1.980107 -2.422742 -1.608424
H  2.120937 -0.863418 -2.469261
H  3.526005 -1.529538 -1.576718
H  0.098148 1.947751 0.012614
H  -0.567736 -2.34752 0.011255
H  -2.379604 2.320405 0.023001
H  -3.019912 -1.972465 0.020113
H  3.920019 2.611252 -0.015479
H  4.38241 1.12509 -0.91365
H  4.387535 1.13127 0.890266
H  -4.666664 1.37164 0.483864
H  -4.762479 0.480561 -1.054828
H  -4.930732 -0.396789 0.486069
