program: Gaussian 09
title: 000142839
version: EM64L-G09RevD.01
frameworkgroup: C1[X(C12H13NO3)]
method: RPBEPBE
basis: SDD
operation: Freq
keyword: #p
keyword: freq=noraman
keyword: PBEPBE/SDD
title: #p freq=noraman PBEPBE/SDD
converged: YES YES NO NO
title: Mulliken charges:
elementType: O O O N C C C C C C C C C C C C H H H H H H H H H H H H H
charge: -0.286492 -0.260417 -0.133106 0.010915 -0.370208 -0.344528 -0.255950 -0.686825 0.127370 0.215881 0.163855 -0.313175 -0.353733 -0.243212 -0.200393 0.005227 0.208152 0.208194 0.198739 0.198616 0.227104 0.229277 0.211723 0.212055 0.220407 0.276447 0.259695 0.236564 0.237817
chargesum: 0.00000
title: Mulliken charges with hydrogens summed into heavy atoms:
elementType: O O O N C C C C C C C C C C C C
charge: -0.286492 -0.260417 -0.133106 0.010915 0.046137 0.052827 0.200431 -0.042640 0.127370 0.215881 0.163855 -0.036727 -0.094038 -0.006647 0.037424 0.005227
polarizability: 1.87971933e+02 -7.96031904e+00 1.94155144e+02 1.07306042e+00 8.35713586e-02 7.49508329e+01
1716.lowfreq: -6.5040 -0.0002 0.0005 0.0006 3.5039 6.3696 23.6561 49.5033 56.3596
frequency: 23.5426 49.4963 56.3317 57.8734 75.5160 95.2161 110.6668 124.7726 177.3767 184.2482 224.3334 231.3842 270.4652 290.5797 357.0143 413.0959 418.3625 436.0165 457.3550 508.2775 509.8742 523.1224 551.2038 650.5820 676.4804 737.3533 740.6630 761.8082 782.4759 797.0048 809.4506 890.8809 897.4365 915.5771 931.5969 975.4485 999.6854 1034.6999 1037.7693 1044.3442 1081.7361 1098.4186 1124.4889 1141.1360 1147.6022 1175.2340 1212.6748 1238.0022 1268.0410 1271.3675 1275.6494 1288.0680 1344.7487 1368.2871 1377.1675 1391.8278 1409.6161 1453.0257 1469.1562 1472.8077 1477.9685 1480.7217 1491.0003 1512.4291 1560.6326 1587.8068 1621.1954 2273.1451 2971.2526 2976.8176 2990.9782 3004.2452 3014.6523 3045.5983 3071.3627 3078.0461 3080.2379 3140.7737 3158.3617 3174.4298 3185.0479
redmass: 3.7495 5.0549 1.9831 5.5736 5.4321 7.3251 2.3450 3.2356 3.9754 3.9954 5.3630 1.1574 5.5957 6.0085 8.4892 3.4053 7.4929 3.5438 6.5522 8.7741 11.6085 3.6842 7.4066 6.7351 4.5294 6.8313 1.0702 2.9903 1.5541 1.1589 7.3467 1.4384 2.9699 2.9385 1.1655 1.3716 1.3372 3.8778 2.7646 4.6688 2.2494 3.7868 2.6461 1.7109 1.4845 1.0650 1.3443 3.2538 1.3995 1.1642 1.4163 1.0822 1.4577 3.0595 2.4042 1.2234 2.2991 2.7531 1.0815 1.0664 1.0421 1.0646 1.0921 6.3585 6.8622 8.5509 7.5784 12.7125 1.0587 1.0367 1.0597 1.0567 1.1003 1.1036 1.1031 1.0995 1.1060 1.0866 1.0915 1.0961 1.0978
irintensity: 0.0099 0.4502 0.1882 1.1423 0.1643 2.4926 0.0251 1.7664 1.0004 2.3916 6.7982 0.1756 0.4809 8.1284 0.6557 20.6213 6.3163 0.2574 6.3499 28.8217 11.2798 10.0389 17.7776 3.9770 19.2976 8.0036 9.2568 36.9026 48.6034 0.1511 13.7347 1.6604 29.3274 2.6792 0.4290 3.1452 0.0202 54.7888 35.6876 220.6492 13.3924 51.9817 1.4609 30.3973 2.5220 10.4260 0.0900 369.5900 7.7191 1.4840 54.0427 0.1470 2.4121 8.8546 6.8502 8.8725 25.3691 18.2627 0.5819 0.6000 13.4009 4.7958 18.0551 36.6438 30.8476 68.0443 168.3514 1219.8090 25.1611 31.1666 20.3205 32.9916 5.5609 3.8245 9.9146 48.3581 111.8879 3.2793 13.3940 9.1517 9.8761
temp: 298.150 k
press: 1.00000 atm
elementType: 8 8 8 7 6 6 6 6 6 6 6 6 6 6 6 6 1 1 1 1 1 1 1 1 1 1 1 1 1
symmnumber: 1
zpe: 594156.1 jmol-1
zpe.correction: 0.226302 hartree
zpe.thermalcorrener: 0.242315 hartree
zpe.thermalcorrenthalpy: 0.243259 hartree
zpe.thermalcorrgfe: 0.180618 hartree
zpe.sumelectzpe: -744.339491 hartree
zpe.sumelectthermal: -744.323478 hartree
zpe.sumelectthermalent: -744.322534 hartree
zpe.sumelectthermalfe: -744.385175 hartree
dipole: -1.7213 -4.3969 -0.0125
dipole: 4.7219
quadrupole: -78.0934 -100.4521 -94.1657
quadrupole: -11.1353 0.2154 0.0486
quadrupole: 12.8103 -9.5484 -3.2620 -11.1353 0.2154 0.0486
hfenergy: -744.5657934 hartree
pointgroup: C01 [X(C12H13N1O3)]
dipole: 0.6293125 -1.7087915 0.3675904 debye
polarizability: 188.2373418|8.8547023|189.1814216|2.8727725|-22.7435831|79.6591461 unknown
InChI: InChI=1S/C12H13NO3/c1-2-3-8-16-12(15)10-6-4-5-7-11(10)13-9-14/h4-7H,2-3,8H2,1H3
charge 0 multiplicity 1
29 atoms
O  1.342086 -0.28249 0.162814
O  0.108497 1.63712 -0.262867
O  -2.091911 3.640862 -0.801092
N  -2.69608 1.3301 -0.357093
C  3.770232 -0.406765 0.209391
C  5.118477 0.348909 0.127668
C  2.583435 0.544308 0.060533
C  6.330102 -0.598542 0.25929
C  -1.042397 -0.494713 0.100752
C  0.14002 0.398934 -0.021543
C  -2.378841 0.006295 -0.067886
C  -0.861448 -1.875019 0.392959
C  -3.476804 -0.887384 0.061621
C  -1.95618 -2.748354 0.518787
C  -3.270777 -2.247332 0.351511
C  -2.270883 2.464908 -0.568238
H  3.723582 -1.176103 -0.585282
H  3.696865 -0.936779 1.178605
H  5.160844 1.117476 0.925722
H  5.178936 0.89454 -0.835741
H  2.555845 1.310872 0.857148
H  2.578713 1.063421 -0.91562
H  6.31099 -1.135849 1.225965
H  6.330048 -1.356066 -0.5466
H  7.282929 -0.042037 0.200451
H  0.160457 -2.24137 0.518829
H  -4.483887 -0.481937 -0.071585
H  -1.791528 -3.806612 0.744501
H  -4.132321 -2.916693 0.447102
