program: Gaussian 09
title: 000142825
version: EM64L-G09RevD.01
frameworkgroup: C1[X(C9H18N2)]
method: RPBEPBE
basis: SDD
operation: Freq
keyword: #pfreq=noraman
keyword: PBEPBE/SDD
title: #p freq=noraman PBEPBE/SDD
converged: YES YES NO NO
title: Mulliken charges:
elementType: N N C C C C C C C C C H H H H H H H H H H H H H H H H H H
charge: -0.089724 -0.337589 -0.131500 -0.384536 -0.440045 -0.354018 -0.358295 -0.453505 -0.439960 -0.447002 -0.394734 0.220434 0.225592 0.186553 0.250121 0.202752 0.225243 0.174635 0.178424 0.215336 0.218568 0.219614 0.226598 0.202974 0.209228 0.222626 0.250482 0.180082 0.221647
chargesum: 0.00000
title: Mulliken charges with hydrogens summed into heavy atoms:
elementType: N N C C C C C C C C C
charge: -0.089724 -0.087107 0.088934 0.027609 0.012827 0.045860 0.035465 -0.015323 -0.010388 -0.015148 0.006995
polarizability: 1.29810389e+02 2.47371090e-02 9.64224198e+01 1.53649817e+00 -7.20124192e-01 9.33462113e+01
1716.lowfreq: -11.9740 0.0003 0.0004 0.0005 6.1633 18.5009 25.0683 47.7067 60.7574
frequency: 23.6491 47.4835 60.3001 78.3294 131.1481 181.2258 251.8150 290.6086 328.9551 337.6224 436.6763 461.1388 587.1450 606.6472 634.1468 742.8097 773.0592 806.8829 849.1790 859.6589 874.5931 877.7883 899.1476 917.4321 932.9307 961.4963 966.7261 989.3478 1012.6977 1062.1141 1078.2960 1087.6550 1095.0103 1120.2465 1129.9101 1140.8665 1164.0468 1172.0041 1187.7180 1191.5032 1212.9088 1223.8872 1232.2208 1240.7863 1257.9527 1285.0745 1288.3690 1291.7962 1306.6373 1307.8663 1328.1460 1340.9890 1349.7725 1372.9290 1408.6702 1455.5089 1462.8445 1467.0531 1476.2165 1478.2309 1479.4209 1495.6248 1500.7487 2826.1559 2833.4505 2849.0061 2883.4294 2934.7300 3001.5637 3005.7144 3009.0378 3020.6831 3022.1745 3028.1011 3031.7713 3040.3904 3064.7977 3072.5271 3085.5305 3090.1396 3502.4926
redmass: 1.7683 2.9192 2.4366 2.7295 3.3498 2.3883 1.8005 3.8308 2.4577 2.1993 1.7526 1.9392 1.9522 2.8493 3.1408 1.7955 1.8216 2.2085 1.5878 2.7431 1.6127 2.1681 2.6061 2.3678 2.2085 1.8537 1.5752 1.5134 2.0040 2.5162 1.5596 1.7873 1.7228 2.4552 1.9367 2.2502 1.5116 1.5872 1.3644 1.3604 1.3898 1.4968 1.5859 1.2118 1.2875 1.2574 1.3104 1.3678 1.2988 1.2614 1.4520 1.4686 1.3889 1.4600 1.3772 1.0849 1.0828 1.0869 1.0931 1.0882 1.0810 1.1031 1.0893 1.0715 1.0722 1.0699 1.0713 1.0836 1.0649 1.0718 1.0596 1.0673 1.0800 1.0882 1.0865 1.0854 1.1046 1.0993 1.1045 1.1054 1.0766
irintensity: 0.1056 0.2639 0.9478 0.2716 1.4384 3.6035 0.9245 1.4557 0.5517 5.0125 23.5564 87.6736 3.7383 3.6270 0.6354 11.5319 13.8107 0.7786 3.3085 15.2716 1.0304 1.3310 6.3516 0.5246 7.6488 4.4549 1.6611 1.1671 4.3474 3.9065 10.2208 10.3638 6.8286 39.1442 18.6998 47.7402 0.9357 4.5077 1.7796 6.0870 7.8613 11.0439 20.5605 5.9600 14.7468 8.0182 3.3249 2.9792 4.1120 0.2640 10.4915 13.7784 2.1382 0.1725 12.2007 8.3341 3.0006 9.2079 10.9981 11.0653 0.9142 2.6409 0.9866 68.8847 28.7650 234.6720 142.3214 54.1989 37.2765 22.2154 20.6709 70.5122 60.1154 20.3998 100.7173 17.4258 2.3094 19.4778 55.2539 78.4403 0.0185
temp: 298.150 k
press: 1.00000 atm
elementType: 7 7 6 6 6 6 6 6 6 6 6 1 1 1 1 1 1 1 1 1 1 1 1 1 1 1 1 1 1
symmnumber: 1
zpe: 687346.5 jmol-1
zpe.correction: 0.261796 hartree
zpe.thermalcorrener: 0.273171 hartree
zpe.thermalcorrenthalpy: 0.274116 hartree
zpe.thermalcorrgfe: 0.222698 hartree
zpe.sumelectzpe: -462.326949 hartree
zpe.sumelectthermal: -462.315575 hartree
zpe.sumelectthermalent: -462.314630 hartree
zpe.sumelectthermalfe: -462.366048 hartree
dipole: 0.1898 -0.9099 0.4160
dipole: 1.0183
quadrupole: -64.9958 -66.1018 -70.7306
quadrupole: 1.0304 -2.4379 -0.5676
quadrupole: 2.2802 1.1743 -3.4545 1.0304 -2.4379 -0.5676
hfenergy: -462.5887459 hartree
pointgroup: C01 [X(C9H18N2)]
dipole: -0.0750788 -0.1694807 0.3551794 debye
polarizability: 129.8017222|1.6323759|93.377868|0.1321505|-0.7640965|96.3994298 unknown
InChI: InChI=1S/C9H18N2/c1-2-7-11(6-1)8-9-4-3-5-10-9/h9-10H,1-8H2
charge 0 multiplicity 1
29 atoms
N  -1.176291 0.088023 -0.081913
N  2.457678 0.70294 0.918409
C  1.232145 -0.116822 0.664553
C  0.083401 0.80819 0.189305
C  1.669033 -1.142115 -0.422488
C  -2.208045 0.901233 -0.776211
C  -1.869792 -0.466262 1.110739
C  2.941805 -0.512141 -1.048355
C  -3.468448 0.005899 -0.719438
C  -3.292302 -0.828001 0.595296
C  3.617269 0.155311 0.170533
H  0.902542 -0.651496 1.581942
H  0.416015 1.302583 -0.74293
H  -0.055413 1.618902 0.952319
H  0.854031 -1.3171 -1.14469
H  1.925859 -2.111329 0.045622
H  -1.88657 1.139556 -1.805989
H  -2.398017 1.870167 -0.243953
H  -1.937604 0.297094 1.930145
H  -1.328927 -1.340807 1.513311
H  3.593909 -1.253715 -1.540942
H  2.669041 0.258106 -1.792794
H  -3.494644 -0.665018 -1.595116
H  -4.396477 0.604071 -0.721645
H  -4.059415 -0.581047 1.350152
H  -3.37142 -1.907515 0.381511
H  2.633627 0.937125 1.900066
H  4.195715 -0.609755 0.74289
H  4.316894 0.960122 -0.123329
