program: Gaussian 09
title: 000142807
version: EM64L-G09RevD.01
frameworkgroup: C1[X(C14H15N)]
method: RPBEPBE
basis: SDD
operation: Freq
keyword: #pfreq=noraman
keyword: PBEPBE/SDD
title: #p freq=noraman PBEPBE/SDD
converged: YES YES NO NO
title: Mulliken charges:
elementType: N C C C C C C C C C C C C C C H H H H H H H H H H H H H H H
charge: -0.450950 -0.553961 -0.553968 0.391760 0.391755 -0.561955 -0.561975 0.429086 0.429103 -0.451328 -0.451311 -0.348826 -0.348823 -0.428248 -0.428258 0.230519 0.207807 0.207811 0.230519 0.216725 0.216257 0.216257 0.216728 0.319906 0.245603 0.245606 0.231929 0.231927 0.240151 0.240153
chargesum: 0.00000
title: Mulliken charges with hydrogens summed into heavy atoms:
elementType: N C C C C C C C C C C C C C C
charge: -0.131044 -0.115634 -0.115638 0.391760 0.391755 -0.128973 -0.128991 0.429086 0.429103 -0.205725 -0.205705 -0.116897 -0.116896 -0.188097 -0.188105
polarizability: 1.77286467e+02 -2.04399624e-04 1.30626745e+02 2.21004878e-04 1.95971354e+01 1.20544742e+02
1716.lowfreq: -10.4407 -7.0365 0.0005 0.0006 0.0007 16.5738 100.0485 129.7387 142.6648
frequency: 100.0118 129.7304 142.6203 189.7096 229.3695 265.6027 291.3267 331.1269 356.8584 358.8570 374.1050 428.7384 490.2418 503.4008 564.7465 612.8897 625.7752 642.2039 642.2596 665.3916 698.6002 722.8661 736.4656 772.1967 779.4501 797.9271 807.7526 835.4389 846.8855 874.9497 881.5140 884.8781 940.4339 952.4346 955.5803 977.4323 992.2049 996.4709 1004.4102 1041.1808 1096.2385 1137.7244 1144.0828 1167.2021 1168.8556 1183.6399 1184.0751 1200.4431 1204.1725 1261.8760 1264.3154 1268.4105 1291.9015 1310.5979 1314.3286 1319.1543 1373.8927 1398.9062 1405.9576 1414.1610 1457.9905 1458.2231 1473.2640 1473.5916 1493.8447 1496.4705 1566.5200 1577.9159 1601.9373 2981.0371 2981.5057 2996.0414 2997.0122 3048.4241 3048.6551 3066.6062 3066.9475 3102.0327 3122.2099 3126.4895 3147.9216 3194.0214 3215.2511 3570.4115
redmass: 2.3851 3.8694 2.8963 5.9273 2.5914 3.5597 2.4300 2.3015 2.6029 4.4144 4.2274 2.7319 5.1914 3.8989 2.8166 2.7789 6.2928 1.2708 3.9161 4.0318 3.0784 2.2415 3.5453 1.2691 1.8755 2.0288 1.3805 1.4920 1.9821 2.3992 3.8509 4.2828 1.3945 1.4383 1.9289 1.9884 3.1469 2.5928 2.8901 1.4686 1.4017 1.1449 1.1852 1.2806 1.2928 1.1301 1.4317 3.2222 1.8548 1.1874 2.2416 1.4215 1.3348 1.2435 1.4919 1.6818 6.8530 2.5304 3.2084 3.4090 1.0969 1.1291 1.1285 1.1061 2.6148 6.9744 6.3991 3.6789 6.3112 1.0633 1.0634 1.0606 1.0609 1.0994 1.0991 1.1030 1.1028 1.0865 1.0869 1.0959 1.0973 1.0924 1.1032 1.0798
irintensity: 0.2622 2.4708 0.2261 0.0012 1.3559 0.1413 0.6950 0.1906 0.2204 2.0181 0.5684 0.0536 0.0387 0.0002 19.7557 42.0155 0.0331 85.3558 1.5582 2.6191 30.4423 0.2232 18.5983 93.4989 10.1211 22.9649 12.5530 0.6141 3.2146 35.3476 0.2313 0.0728 5.2940 1.6381 0.2637 0.1164 0.8034 1.9283 0.1581 24.2414 5.5864 2.9959 1.9369 5.4548 4.2268 0.4059 16.4076 3.4598 6.9032 2.3140 3.4218 2.1254 3.8651 0.0489 0.0951 2.7407 0.3566 9.6506 2.3391 4.6156 13.5948 0.1274 0.1206 11.7556 13.3773 6.1066 0.0408 4.2610 6.4372 11.1907 52.8078 144.6185 10.0863 29.2108 7.7550 7.5929 54.6639 9.3301 9.5818 27.3848 8.0858 6.9178 6.2811 40.8454
temp: 298.150 k
press: 1.00000 atm
elementType: 7 6 6 6 6 6 6 6 6 6 6 6 6 6 6 1 1 1 1 1 1 1 1 1 1 1 1 1 1 1
symmnumber: 1
zpe: 662840.6 jmol-1
zpe.correction: 0.252463 hartree
zpe.thermalcorrener: 0.263996 hartree
zpe.thermalcorrenthalpy: 0.264940 hartree
zpe.thermalcorrgfe: 0.216166 hartree
zpe.sumelectzpe: -596.139794 hartree
zpe.sumelectthermal: -596.128261 hartree
zpe.sumelectthermalent: -596.127317 hartree
zpe.sumelectthermalfe: -596.176091 hartree
dipole: 0.0000 -0.5365 -1.0266
dipole: 1.1583
quadrupole: -79.2160 -98.3064 -84.2922
quadrupole: 0.0001 0.0000 7.7586
quadrupole: 8.0556 -11.0349 2.9793 0.0001 0.0000 7.7586
hfenergy: -596.392257 hartree
pointgroup: C01 [X(C14H15N1)]
dipole: -0.0000525 0.1370328 -0.4346132 debye
polarizability: 177.2864625|0.0163732|123.5561446|0.0064036|-20.1330593|127.615348 unknown
InChI: InChI=1S/C14H15N/c1-2-12-4-3-11(1)5-7-13-9-10-14(15-13)8-6-12/h1-4,9-10,15H,5-8H2
charge 0 multiplicity 1
30 atoms
N  0.000322 -1.061314 -0.845889
C  2.496804 -0.866582 -0.572457
C  -2.496281 -0.868187 -0.572437
C  1.15835 -1.44939 -0.165366
C  -1.157447 -1.450105 -0.165336
C  2.755143 0.642503 -0.08072
C  -2.755555 0.640798 -0.080839
C  1.422422 1.354628 0.08649
C  -1.423277 1.353729 0.086429
C  0.723173 -2.218701 0.93019
C  -0.721757 -2.219037 0.930286
C  0.703841 1.136485 1.290732
C  -0.704614 1.136043 1.290703
C  0.709518 1.903746 -1.014026
C  -0.710672 1.903293 -1.014059
H  3.312908 -1.501576 -0.184156
H  2.582908 -0.880515 -1.677347
H  -2.582441 -0.882299 -1.677321
H  -3.311961 -1.50365 -0.184016
H  3.417247 1.138729 -0.815312
H  3.292082 0.605775 0.88497
H  -3.292557 0.603807 0.884806
H  -3.417892 1.136572 -0.815525
H  0.000101 -0.378371 -1.602386
H  1.370126 -2.701795 1.662068
H  -1.368386 -2.70245 1.662238
H  1.240764 0.801521 2.185526
H  -1.241366 0.800751 2.185478
H  1.251356 2.201296 -1.921433
H  -1.252661 2.200495 -1.921489
