program: Gaussian 09
title: 000142795
version: EM64L-G09RevD.01
frameworkgroup: C1[X(C3H6OS)]
method: RPBEPBE
basis: SDD
operation: Freq
keyword: #pfreq=noraman
keyword: PBEPBE/SDD
title: #p freq=noraman PBEPBE/SDD
converged: YES YES NO NO
title: Mulliken charges:
elementType: S O C C C H H H H H H
charge: 0.125786 -0.394614 -0.334553 -0.356889 -0.666125 0.236384 0.252397 0.253859 0.264318 0.260475 0.358963
chargesum: 0.00000
title: Mulliken charges with hydrogens summed into heavy atoms:
elementType: S O C C C
charge: 0.125786 -0.035651 0.154228 -0.103030 -0.141333
polarizability: 6.08292062e+01 1.24085567e+00 5.50347172e+01 -2.56914643e+00 1.02908287e-01 3.57623856e+01
1716.lowfreq: -12.9408 0.0012 0.0020 0.0022 13.1135 20.4760 91.1926 294.9070 361.3070
frequency: 91.1765 294.9062 361.3056 430.0023 496.3192 591.1894 675.5398 813.3571 910.8220 954.7756 995.1851 1034.9403 1070.2500 1170.3500 1212.9911 1217.5781 1246.9287 1285.7031 1381.5096 1451.9200 1469.2232 3022.1947 3028.0977 3052.9730 3098.7276 3133.8254 3566.6369
redmass: 2.1332 4.4487 1.2503 3.0737 5.4518 5.4426 3.8357 1.2703 2.0971 1.5603 2.2612 2.4874 1.2796 1.3892 1.2928 1.2175 1.2029 1.3833 1.4810 1.0842 1.1116 1.0757 1.0719 1.0574 1.1053 1.1112 1.0661
irintensity: 2.5768 25.6169 149.0661 17.4815 30.3865 36.7367 5.0620 6.4238 40.4515 6.9354 10.3437 205.3348 12.0681 7.4219 34.7152 10.3810 13.6018 30.3669 10.3800 11.0942 4.3585 31.2070 44.5534 41.6745 12.1507 26.6244 18.4396
temp: 298.150 k
press: 1.00000 atm
elementType: 16 8 6 6 6 1 1 1 1 1 1
symmnumber: 1
zpe: 227640.0 jmol-1
zpe.correction: 0.086703 hartree
zpe.thermalcorrener: 0.092223 hartree
zpe.thermalcorrenthalpy: 0.093167 hartree
zpe.thermalcorrgfe: 0.057521 hartree
zpe.sumelectzpe: -590.759420 hartree
zpe.sumelectthermal: -590.753900 hartree
zpe.sumelectthermalent: -590.752956 hartree
zpe.sumelectthermalfe: -590.788602 hartree
dipole: -0.6977 1.0898 1.4960
dipole: 1.9779
quadrupole: -35.5861 -37.1116 -38.2259
quadrupole: 6.2422 -3.2501 -0.4557
quadrupole: 1.3885 -0.1371 -1.2514 6.2422 -3.2501 -0.4557
hfenergy: -590.8461232 hartree
pointgroup: C01 [X(C3H6O1S1)]
dipole: -0.1173292 0.543422 0.5445118 debye
dipolederiv: -0.4819699 0.1292721 -0.0001355 0.2476917 -0.5116412 -0.0000534 0.0660759 -0.0084003 -0.1927724 -1.0609959 0.3814847 -0.197671 0.3015215 -0.4191535 -0.1597352 -0.4236194 -0.024055 -0.42215 -0.1472322 -0.0141786 0.0587092 -0.0163064 0.0245931 0.0879418 0.0932094 0.0145247 0.0676051 1.1744489 -0.43647 0.1113451 -0.5634591 0.5931328 0.0813956 0.2692078 -0.026003 0.4063758 0.2262931 0.090635 -0.0222464 0.240462 0.0940927 -0.0204794 -0.0508059 0.008847 0.1616727 0.0965733 -0.0382137 -0.0137752 -0.0252271 -0.1367101 -0.0901268 -0.0325668 -0.128461 0.0424905 0.0861964 0.0326922 -0.0436798 0.015769 0.07216 0.0248347 -0.0350871 0.0682156 -0.0622027 -0.0551676 0.0309812 0.0459552 0.1000784 -0.0302397 -0.0480326 0.0447235 -0.0357136 -0.1865283 -0.0416484 -0.0280146 0.1023833 -0.0513056 0.0485215 0.0237814 0.1359609 0.005277 -0.0351931 -0.0653911 -0.029458 -0.0878373 -0.0850667 0.0180625 -0.0240856 -0.1235969 -0.010325 -0.0524652 0.2688934 -0.1187303 0.0469526 -0.1641577 0.2471818 0.1245595 0.0564985 0.1360935 0.2731675 unknown
polarizability: 61.0210548|-1.1952924|54.9943303|-1.5444203|-0.5248788|35.6109241 unknown
InChI: InChI=1S/C3H6OS/c4-3-1-2-5-3/h3-4H,1-2H2
charge 0 multiplicity 1
11 atoms
S  0.418474 -1.347891 0.122952
O  -1.830737 0.467451 -0.355541
C  0.493095 1.181702 -0.051537
C  -0.656324 0.276106 0.436214
C  1.638559 0.132197 -0.021958
H  0.659975 2.086457 0.557103
H  0.264912 1.484162 -1.087146
H  -0.863974 0.320213 1.520703
H  2.257185 0.072725 -0.928813
H  2.270588 0.180017 0.877132
H  -2.586452 -0.071339 -0.009509
