program: Gaussian 09
title: 000142787
version: EM64L-G09RevD.01
frameworkgroup: C1[X(C12H13NO)]
method: RPBEPBE
basis: SDD
operation: Freq
keyword: #p
keyword: freq=noraman
keyword: PBEPBE/SDD
title: #p freq=noraman PBEPBE/SDD
converged: YES YES NO NO
title: Mulliken charges:
elementType: O N C C C C C C C C C C C C H H H H H H H H H H H H H
charge: -0.271559 -0.177032 -0.428408 -0.376806 -0.428673 -0.243456 -0.097012 0.155285 0.231507 -0.312782 -0.366990 -0.248141 -0.225672 -0.227859 0.225941 0.208896 0.252300 0.212703 0.222936 0.213346 0.210160 0.271290 0.239894 0.266260 0.230204 0.231681 0.231989
chargesum: 0.00000
title: Mulliken charges with hydrogens summed into heavy atoms:
elementType: O N C C C C C C C C C C C C
charge: -0.271559 -0.177032 0.006429 0.088197 0.007609 -0.033297 0.174278 0.155285 0.231507 -0.072887 -0.100730 -0.017937 0.006010 0.004129
polarizability: 2.10914683e+02 -8.87262356e-01 1.24480868e+02 9.78954553e+00 1.20669897e+01 8.79733486e+01
1716.lowfreq: -10.2457 0.0006 0.0007 0.0008 2.5706 8.7191 50.4950 62.0794 85.4211
frequency: 50.4623 62.0442 85.4087 103.8651 189.5738 221.9967 252.5588 281.4407 314.4391 371.8001 406.3970 424.0703 456.6011 515.1363 546.4718 605.0974 614.3143 673.7583 696.9666 706.5981 734.4403 743.6403 787.3789 854.7602 859.5108 874.6513 907.0076 936.4174 946.5408 958.6786 982.4864 987.1703 989.9996 1000.5736 1027.3572 1066.3816 1078.7603 1085.2850 1121.1229 1140.2618 1173.6065 1180.3763 1189.6927 1227.8726 1259.8526 1289.1033 1316.4323 1323.7151 1338.4296 1342.6559 1352.8123 1380.0729 1392.7781 1432.3730 1456.6272 1464.7763 1474.9744 1480.1245 1547.5018 1589.3401 1609.2859 1664.7716 2958.0264 2971.2539 2999.4621 3020.5485 3064.9011 3091.6526 3126.8452 3136.2135 3147.2207 3147.9003 3158.2595 3169.3979 3186.8223
redmass: 4.2284 3.4063 3.4924 4.8607 3.5212 3.3387 4.0400 2.9913 2.8894 6.8754 2.8537 4.1576 2.1648 3.0936 4.7395 6.0766 6.4261 4.1936 5.9616 1.5638 1.4618 1.9466 2.2809 3.1656 1.3314 1.4316 3.6167 1.4574 1.8328 1.4659 1.3876 2.8841 5.8641 1.3399 2.2514 1.7854 1.7853 1.6619 1.4756 1.9499 1.0546 1.4956 1.1185 1.4127 1.3519 2.5068 1.3262 1.4881 1.4083 2.4947 1.3497 8.3357 1.7480 2.2409 1.0875 1.0944 1.1037 2.2324 10.0747 6.3213 6.0171 6.4604 1.0655 1.0688 1.0644 1.0902 1.1029 1.0953 1.0848 1.0881 1.0880 1.0928 1.0963 1.1010 1.0971
irintensity: 1.0323 0.1163 1.0198 2.0263 0.4312 1.1192 4.5349 0.8359 0.1448 5.5250 0.2018 4.8029 9.8881 7.8370 2.1013 9.9064 0.9401 28.7867 11.5756 80.0096 30.0949 7.6267 29.6931 11.4555 0.6990 3.8239 4.0927 3.8141 19.8010 1.4839 1.1015 59.8338 1.6547 0.3391 6.9489 7.1211 4.9641 14.5467 13.4390 18.8938 0.0611 0.7397 7.7098 21.7885 88.4492 70.1454 2.2596 18.3390 4.6099 258.5998 1.2563 1.0030 84.2045 8.5947 9.3607 16.5575 7.2387 5.5203 223.0201 15.2799 3.7068 24.1796 43.2616 34.9088 17.5542 49.3028 39.2338 15.2033 0.8051 4.1226 11.5524 23.9050 22.3470 18.3111 13.9282
temp: 298.150 k
press: 1.00000 atm
elementType: 8 7 6 6 6 6 6 6 6 6 6 6 6 6 1 1 1 1 1 1 1 1 1 1 1 1 1
symmnumber: 1
zpe: 582145.4 jmol-1
zpe.correction: 0.221727 hartree
zpe.thermalcorrener: 0.233541 hartree
zpe.thermalcorrenthalpy: 0.234485 hartree
zpe.thermalcorrgfe: 0.183173 hartree
zpe.sumelectzpe: -594.036680 hartree
zpe.sumelectthermal: -594.024867 hartree
zpe.sumelectthermalent: -594.023923 hartree
zpe.sumelectthermalfe: -594.075235 hartree
dipole: -0.3512 -4.3792 0.5038
dipole: 4.4221
quadrupole: -68.9743 -87.4996 -81.9560
quadrupole: -0.0425 1.6735 3.2976
quadrupole: 10.5023 -8.0230 -2.4793 -0.0425 1.6735 3.2976
hfenergy: -594.2584076 hartree
pointgroup: C01 [X(C12H13N1O1)]
dipole: -0.0637253 1.5498616 0.7878367 debye
polarizability: 210.1328466|4.8302324|102.092439|-12.3237881|21.4740932|111.1436143 unknown
InChI: InChI=1S/C12H13NO/c14-12(11-7-3-1-4-8-11)13-9-5-2-6-10-13/h1,3-5,7-9H,2,6,10H2
charge 0 multiplicity 1
27 atoms
O  -0.165976 -1.963422 -1.25457
N  -1.249397 -0.278437 -0.058722
C  -2.594519 1.820111 -0.023135
C  -1.315112 1.109335 0.473223
C  -3.858596 1.046004 0.417863
C  -3.685596 -0.435548 0.141387
C  -2.473742 -0.997578 -0.125418
C  -0.088963 -0.887843 -0.578187
C  1.253187 -0.261898 -0.302174
C  1.631801 0.232007 0.974004
C  2.218357 -0.299327 -1.342157
C  2.946154 0.697785 1.197958
C  3.524561 0.185352 -1.123842
C  3.892654 0.686895 0.147481
H  -2.564896 1.885043 -1.126937
H  -2.604878 2.852702 0.37206
H  -0.416265 1.657145 0.151015
H  -1.32261 1.079996 1.581875
H  -4.744971 1.429808 -0.123547
H  -4.061759 1.22073 1.495526
H  -4.570501 -1.080418 0.121535
H  -2.35208 -2.045975 -0.407831
H  0.914408 0.221386 1.801898
H  1.930738 -0.727144 -2.308039
H  3.232257 1.061061 2.191189
H  4.257541 0.162077 -1.937634
H  4.910604 1.053455 0.32068
