program: Gaussian 09
title: 000142754
version: EM64L-G09RevD.01
frameworkgroup: C1[X(C14H14O)]
method: RPBEPBE
basis: SDD
operation: Freq
keyword: #pfreq=noraman
keyword: PBEPBE/SDD
title: #p freq=noraman PBEPBE/SDD
converged: YES YES NO NO
title: Mulliken charges:
elementType: O C C C C C C C C C C C C C C H H H H H H H H H H H H H H
charge: -0.473192 -0.168816 0.300968 -0.549370 -0.549538 0.301253 0.319751 0.320183 -0.434699 -0.433935 -0.405202 -0.192980 -0.438566 -0.240921 -0.718752 0.233475 0.232440 0.232979 0.233346 0.237941 0.239811 0.278986 0.199983 0.228256 0.217404 0.242145 0.241580 0.203517 0.341956
chargesum: 0.00000
title: Mulliken charges with hydrogens summed into heavy atoms:
elementType: O C C C C C C C C C C C C C C
charge: -0.131236 -0.168816 0.300968 -0.083455 -0.083212 0.301253 0.319751 0.320183 -0.196758 -0.194124 -0.126216 0.007003 -0.210311 -0.023518 -0.031511
polarizability: 1.99142384e+02 -4.83706285e+00 1.81919098e+02 -2.31912988e+00 -3.17940684e+00 7.99150182e+01
1716.lowfreq: -10.7249 0.0004 0.0007 0.0008 3.5431 5.1418 64.3592 76.7896 86.8523
frequency: 64.3255 76.7759 86.8503 165.6429 171.9419 221.0251 227.6639 255.9544 261.6510 301.3367 365.7809 425.6385 439.0911 452.1847 465.2544 492.3886 515.6824 559.8605 593.4979 631.3196 649.0295 663.3854 727.6058 752.3660 781.7016 798.5717 837.5140 841.4750 858.6944 896.4601 906.8003 954.9989 968.5164 972.1772 996.4472 1011.6187 1013.4027 1046.8444 1063.1999 1076.7661 1118.6239 1141.0576 1142.6351 1182.2184 1187.4702 1203.2877 1218.5306 1221.1790 1250.6303 1261.5785 1290.9493 1301.8291 1362.7185 1370.6721 1385.4347 1396.9284 1414.4429 1444.8000 1459.6912 1464.5326 1467.1666 1471.0926 1479.0263 1512.6442 1603.7877 1610.1676 1622.0994 2935.9179 2974.2439 2988.6180 3001.8606 3031.3847 3053.7160 3068.9703 3095.4411 3118.4114 3130.9638 3134.4944 3152.1578 3169.6849 3569.0625
redmass: 3.1326 2.8538 2.2703 3.8161 3.7242 3.0643 2.8758 1.1965 1.1627 3.8697 4.0427 3.4130 3.6404 3.9982 3.2452 3.4373 6.9027 5.8556 2.8768 4.4754 4.6120 3.4343 4.3074 1.7134 1.3923 4.9357 2.4078 3.2497 1.3768 1.4047 3.0078 3.2365 1.3526 1.3338 2.0909 1.9494 3.5920 2.1186 2.2259 2.0636 2.8861 1.9439 1.1767 1.2707 1.3088 1.1027 1.4807 1.2685 1.9158 1.7608 1.8121 1.2796 1.9679 2.7537 1.2514 2.2143 2.6513 1.1946 2.4261 1.1827 1.2736 1.3131 1.9663 4.4096 6.5651 8.4201 7.7850 1.0833 1.0379 1.0591 1.0618 1.1026 1.1024 1.0967 1.1000 1.0853 1.0903 1.0917 1.0982 1.0927 1.0661
irintensity: 0.5168 4.3853 1.0679 3.4797 4.0253 5.3475 0.0965 9.2831 127.1585 24.3955 4.9898 1.6846 5.3887 1.8648 0.0962 0.6848 1.4280 1.0405 1.0808 8.6094 0.8207 10.6315 0.4070 11.6058 47.2892 0.1516 0.6073 19.3590 56.3157 5.7932 4.6848 1.7847 2.5514 0.6538 6.1074 0.0999 7.6955 5.0710 81.9793 23.0357 15.1303 28.8962 0.4043 6.9752 8.7146 0.0042 1.4716 0.4955 5.9194 0.5342 4.0875 12.6655 30.8162 9.7251 19.0428 0.8882 5.8341 5.7471 8.4912 14.5930 2.3119 8.3665 1.6340 5.7154 13.9940 13.7905 13.6830 42.3172 43.2458 20.2364 56.7073 0.0220 34.0195 42.7558 18.1955 1.9259 19.0423 25.2673 36.9666 3.8274 2.5929
temp: 298.150 k
press: 1.00000 atm
elementType: 8 6 6 6 6 6 6 6 6 6 6 6 6 6 6 1 1 1 1 1 1 1 1 1 1 1 1 1 1
symmnumber: 1
zpe: 625656.3 jmol-1
zpe.correction: 0.238300 hartree
zpe.thermalcorrener: 0.250997 hartree
zpe.thermalcorrenthalpy: 0.251941 hartree
zpe.thermalcorrgfe: 0.199600 hartree
zpe.sumelectzpe: -616.057098 hartree
zpe.sumelectthermal: -616.044401 hartree
zpe.sumelectthermalent: -616.043457 hartree
zpe.sumelectthermalfe: -616.095798 hartree
dipole: -0.0452 1.1090 0.8091
dipole: 1.3735
quadrupole: -70.2864 -82.3470 -93.1276
quadrupole: 6.9775 1.0723 -1.9601
quadrupole: 11.6339 -0.4266 -11.2073 6.9775 1.0723 -1.9601
hfenergy: -616.2953982 hartree
pointgroup: C01 [X(C14H14O1)]
dipole: 0.0323276 0.4193534 -0.3392907 debye
polarizability: 199.4514628|4.0722777|181.6633899|-2.914784|-1.7191563|79.8616475 unknown
InChI: InChI=1S/C14H14O/c1-9(15)12-8-7-11-6-5-10-3-2-4-13(12)14(10)11/h2-4,7-9,15H,5-6H2,1H3
charge 0 multiplicity 1
29 atoms
O  -3.833129 -0.619885 0.691324
C  0.93981 -0.151174 0.00896
C  1.058119 -1.571718 -0.011253
C  2.536433 -1.948182 -0.101545
C  3.304365 -0.570166 -0.135539
C  2.209822 0.493932 -0.055996
C  -0.306542 0.546008 0.092793
C  -1.498389 -0.267987 0.152515
C  -0.106093 -2.336874 0.058493
C  2.262313 1.888741 -0.036009
C  -1.373943 -1.667128 0.138822
C  -2.87364 0.386684 0.192899
C  -0.220941 1.982308 0.114641
C  1.028357 2.61954 0.053071
C  -3.314717 0.901769 -1.199174
H  2.849965 -2.560938 0.764313
H  2.746742 -2.547689 -1.006979
H  3.900792 -0.464961 -1.061168
H  4.012818 -0.483467 0.709406
H  -0.075935 -3.432354 0.056216
H  3.213417 2.43106 -0.082984
H  -2.292368 -2.25674 0.210199
H  -2.847475 1.242033 0.903645
H  -1.127249 2.593797 0.188463
H  1.067937 3.715165 0.076069
H  -3.399054 0.052464 -1.899679
H  -2.581692 1.617112 -1.611871
H  -4.295488 1.413864 -1.142115
H  -4.746033 -0.241114 0.632184
