program: Gaussian 09
title: 000142753
version: EM64L-G09RevD.01
frameworkgroup: C1[X(C8H17N2OP)]
method: RPBEPBE
basis: SDD
operation: Freq
keyword: #p
keyword: freq=noraman
keyword: PBEPBE/SDD
title: #p freq=noraman PBEPBE/SDD
converged: YES YES NO NO
title: Mulliken charges:
elementType: P O N N C C C C C C C C H H H H H H H H H H H H H H H H H
charge: 1.079794 -0.652513 -0.413842 -0.410039 -0.406250 -0.389046 -0.390341 -0.411997 -0.696117 -0.306760 -0.338759 -0.692713 0.263804 0.247886 0.249669 0.251167 0.253505 0.248802 0.247791 0.264987 0.255466 0.273135 0.206109 0.229674 0.196024 0.197161 0.218631 0.210282 0.214491
chargesum: 0.00000
title: Mulliken charges with hydrogens summed into heavy atoms:
elementType: P O N N C C C C C C C C
charge: 1.079794 -0.652513 -0.413842 -0.410039 0.105440 0.111790 0.111966 0.100780 -0.167517 0.129023 0.054426 -0.049309
polarizability: 1.46958878e+02 2.83518826e+00 1.28787867e+02 1.37468450e+00 -1.91113096e-01 9.90241748e+01
1716.lowfreq: -8.9361 -0.0020 -0.0018 -0.0014 6.6687 11.9355 29.2821 37.2298 56.8890
frequency: 28.9738 37.1644 56.7218 59.8526 71.0404 111.4989 122.9506 152.5793 157.5228 186.9294 218.7243 236.0441 255.4781 285.0993 328.0665 380.4010 404.5386 450.8311 526.3140 589.0689 727.3897 739.5253 772.5814 781.6702 791.1854 806.9116 812.5206 880.0335 888.6478 891.0469 902.5819 977.1065 986.5343 994.9130 1024.5176 1060.7139 1070.3349 1073.4016 1076.3084 1101.6568 1107.5692 1116.2040 1118.0736 1121.3735 1150.6398 1155.7941 1205.0756 1230.9058 1234.3535 1236.4867 1276.9217 1296.1005 1310.2911 1351.9863 1390.9520 1422.2884 1440.3933 1442.9277 1455.5444 1459.9503 1469.2790 1475.8875 1476.5301 1488.0084 2968.5972 2974.8930 2982.1479 3011.6494 3013.7606 3042.3725 3069.7976 3071.0799 3071.6302 3075.3366 3075.7639 3078.3270 3090.4328 3180.3367 3181.2467 3197.3778 3198.4185
redmass: 2.6311 3.1632 2.0659 2.4175 4.0296 2.4276 2.6570 3.5570 4.1433 3.3807 1.2737 2.7916 3.9060 3.2571 4.4153 4.1282 3.5898 4.9715 5.9496 8.1551 1.5190 2.1049 1.9495 2.6488 8.4850 1.1179 1.1139 4.4005 3.6252 1.9634 1.3258 5.4442 1.0723 1.0855 3.8169 1.2529 1.3033 2.0164 1.4030 2.0936 1.3189 1.3058 1.2848 1.3372 1.3814 1.3725 1.4876 3.2160 1.3127 3.3779 1.1912 1.0622 1.3445 1.5255 1.2117 1.0790 1.0768 1.0764 1.1803 1.1756 1.0643 1.0433 1.0648 1.0827 1.0580 1.0376 1.0595 1.0988 1.0597 1.1033 1.0491 1.0535 1.0957 1.0986 1.0612 1.0599 1.1033 1.1173 1.1178 1.1175 1.1177
irintensity: 0.2518 1.4217 1.1372 1.7163 1.2791 0.2832 1.6802 10.6750 17.9004 14.1184 1.1493 2.7168 0.2719 1.1508 0.2397 5.6226 1.7962 27.5153 34.7221 63.6437 10.7462 32.3788 1.5987 6.6663 4.2790 38.0476 14.3681 179.3458 74.5632 30.6058 12.2562 60.8625 1.0816 3.1781 1.8546 2.7046 10.9786 7.0849 6.8910 22.6495 3.8623 5.3486 11.2507 6.3714 0.0938 0.2589 1.5819 58.3657 5.9201 32.3105 1.9406 0.1406 0.5834 1.7383 11.2433 6.8908 5.3349 9.5825 1.9229 5.6910 1.2359 12.4658 2.4932 17.1658 20.3765 28.8535 35.5118 4.6869 12.3883 13.8861 13.0284 23.2582 56.4920 49.0055 30.6700 25.2374 18.6064 0.5046 1.0148 9.9129 17.8873
temp: 298.150 k
press: 1.00000 atm
elementType: 15 8 7 7 6 6 6 6 6 6 6 6 1 1 1 1 1 1 1 1 1 1 1 1 1 1 1 1 1
symmnumber: 1
zpe: 638423.6 jmol-1
zpe.correction: 0.243163 hartree
zpe.thermalcorrener: 0.258442 hartree
zpe.thermalcorrenthalpy: 0.259386 hartree
zpe.thermalcorrgfe: 0.198891 hartree
zpe.sumelectzpe: -839.918095 hartree
zpe.sumelectthermal: -839.902816 hartree
zpe.sumelectthermalent: -839.901872 hartree
zpe.sumelectthermalfe: -839.962367 hartree
dipole: 0.2619 0.0128 -1.0629
dipole: 1.0947
quadrupole: -71.5876 -72.6220 -92.9643
quadrupole: -0.0415 -0.5464 -0.1346
quadrupole: 7.4704 6.4360 -13.9063 -0.0415 -0.5464 -0.1346
hfenergy: -840.161258 hartree
pointgroup: C01 [X(C8H17N2O1P1)]
dipole: -0.1015025 -0.0176203 -0.4181932 debye
polarizability: 146.6952646|3.5654718|129.0532168|-1.3113168|-0.4482446|99.0224385 unknown
InChI: InChI=1S/C8H17N2OP/c1-2-3-8-12(11,9-4-5-9)10-6-7-10/h2-8H2,1H3
charge 0 multiplicity 1
29 atoms
P  0.585387 0.200443 0.153635
O  0.696748 0.148779 1.767051
N  1.785267 1.251087 -0.679997
N  0.876745 -1.370272 -0.683968
C  2.25435 2.477679 0.09194
C  3.18831 1.300638 -0.100704
C  1.92286 -2.285883 -0.066757
C  0.454026 -2.619811 0.080798
C  -1.044114 0.783352 -0.551291
C  -2.259021 0.10147 0.112311
C  -3.59629 0.685669 -0.400198
C  -4.821985 -0.002924 0.237489
H  1.857581 2.628921 1.104364
H  2.363878 3.373985 -0.525546
H  3.978738 1.340833 -0.855629
H  3.401191 0.694739 0.789224
H  2.438423 -1.939926 0.838108
H  2.538326 -2.812383 -0.801807
H  -0.000946 -3.390141 -0.548899
H  0.019048 -2.486975 1.079696
H  -1.077733 1.879303 -0.405986
H  -0.996835 0.581672 -1.635605
H  -2.236966 -0.987142 -0.094516
H  -2.197303 0.219498 1.21197
H  -3.625815 1.773014 -0.184124
H  -3.64368 0.58372 -1.503329
H  -5.767393 0.428413 -0.138942
H  -4.831008 -1.085831 0.011317
H  -4.812489 0.109973 1.337795
