program: Gaussian 09
title: 000142741
version: EM64L-G09RevD.01
frameworkgroup: C1[X(C10H12S4)]
method: RPBEPBE
basis: SDD
operation: Freq
keyword: #pfreq=noraman
keyword: PBEPBE/SDD
title: #p freq=noraman PBEPBE/SDD
converged: YES YES NO NO
title: Mulliken charges:
elementType: S S S S C C C C C C C C C C H H H H H H H H H H H H
charge: 0.234256 0.234262 0.234259 0.234260 -0.330639 -0.330639 -0.030604 -0.030608 -0.030606 -0.030608 -0.755479 -0.755478 -0.755479 -0.755479 0.244886 0.227185 0.245075 0.227185 0.244886 0.245075 0.227185 0.245075 0.244886 0.244886 0.245075 0.227185
chargesum: 0.00000
title: Mulliken charges with hydrogens summed into heavy atoms:
elementType: S S S S C C C C C C C C C C
charge: 0.234256 0.234262 0.234259 0.234260 -0.330639 -0.330639 -0.030604 -0.030608 -0.030606 -0.030608 -0.038333 -0.038333 -0.038333 -0.038333
polarizability: 2.80478825e+02 7.48202218e-05 1.85444718e+02 8.42819008e-05 -6.81692392e-04 8.07263730e+01
1716.lowfreq: -16.6842 -9.1661 -0.0019 -0.0014 -0.0014 4.2777 6.2776 45.3550 62.9510
frequency: -16.6842 45.3234 62.9509 70.0084 112.3259 113.0437 127.8365 129.2229 140.2523 141.4358 199.0169 229.0342 231.3945 257.7366 265.4853 296.4319 299.5532 321.7472 372.1194 424.6347 453.6385 461.1951 461.7911 475.2007 484.9060 486.4927 511.7894 517.7788 687.1784 689.1738 715.3328 799.9812 922.0207 922.0587 922.7851 1032.6900 1032.8279 1045.4822 1045.5265 1088.1768 1089.3020 1090.3260 1094.4329 1169.5777 1172.8736 1390.4534 1390.5702 1406.3278 1406.4323 1455.8842 1455.9130 1461.5429 1461.5867 1468.2410 1468.2522 1477.1955 1477.3781 1598.5622 1665.7764 1674.2282 2977.6682 2977.6994 2979.3896 2979.6946 3053.4862 3053.4903 3054.0717 3054.1047 3095.6974 3095.7294 3100.4301 3100.4874
redmass: 4.9897 9.0239 5.0081 5.4992 1.0289 1.0272 1.2747 1.2145 2.1995 2.7652 7.3830 4.9931 12.1241 3.4654 3.5514 2.6309 2.7856 3.9251 6.8842 16.3207 6.6778 23.7515 6.8122 12.1869 4.5952 4.6260 7.5809 7.8403 3.4461 3.3475 13.3881 12.1482 8.0710 1.9689 1.9700 1.3566 1.3580 1.4386 1.4389 1.7901 2.3817 2.3811 1.8798 5.6487 5.5911 1.2368 1.2377 1.2130 1.2128 1.0423 1.0424 1.0423 1.0423 1.0463 1.0464 1.0757 1.0763 11.2173 7.4533 7.7628 1.0370 1.0370 1.0372 1.0372 1.0985 1.0985 1.0986 1.0986 1.0983 1.0983 1.0957 1.0957
irintensity: 3.3259 0.0031 0.0000 1.3374 1.3334 0.0002 0.0000 0.0000 0.0000 0.0000 0.0000 0.0006 7.1881 12.5397 0.0005 0.7690 0.0001 3.0239 0.0000 27.6874 0.0000 0.0016 0.7699 0.0105 0.0000 0.0000 9.4752 0.0010 0.0000 1.0815 57.5241 2.0144 0.0000 0.0009 3.7692 9.7564 0.0005 0.0007 0.0000 27.4456 73.5624 0.0032 0.0000 0.0000 13.7009 0.0000 9.9299 21.5475 0.0013 0.0010 0.0000 0.0044 57.2402 0.0005 11.3929 62.0577 0.0004 0.0009 12.8601 0.0001 0.0309 72.2237 88.7975 0.0019 0.0002 0.0001 0.0393 66.9029 0.0006 27.5135 48.1484 0.0009
temp: 298.150 k
press: 1.00000 atm
elementType: 16 16 16 16 6 6 6 6 6 6 6 6 6 6 1 1 1 1 1 1 1 1 1 1 1 1
symmnumber: 1
zpe: 496404.7 jmol-1
zpe.correction: 0.189071 hartree
zpe.thermalcorrener: 0.205677 hartree
zpe.thermalcorrenthalpy: 0.206621 hartree
zpe.thermalcorrgfe: 0.144544 hartree
zpe.sumelectzpe: -1979.409852 hartree
zpe.sumelectthermal: -1979.393246 hartree
zpe.sumelectthermalent: -1979.392302 hartree
zpe.sumelectthermalfe: -1979.454379 hartree
dipole: 0.0000 0.0000 0.0438
dipole: 0.0438
quadrupole: -75.1583 -110.4324 -118.3834
quadrupole: 0.0000 0.0000 -0.0001
quadrupole: 26.1664 -9.1077 -17.0587 0.0000 0.0000 -0.0001
hfenergy: -1979.598923 hartree
pointgroup: C01 [X(C10H12S4)]
dipole: 0.0000035 0.0000023 -0.0172146 debye
dipolederiv: -0.5786478 -0.0920142 0.0024137 0.3578569 -0.1801664 -0.000719 -0.002683 0.0007291 0.041065 -0.5786277 0.0919851 0.0024188 -0.3578869 -0.1801843 0.000664 -0.0027343 -0.000714 0.0410678 -0.578648 -0.0920161 -0.0024125 0.3578556 -0.1801655 0.0007217 0.002681 -0.0007266 0.0410661 -0.5786258 0.0919845 -0.0024193 -0.3578882 -0.1801856 -0.0006605 0.0027423 0.0007171 0.0410671 0.3897725 0.0000121 0.0018498 0.0000096 0.1135543 0.0000834 0.001055 0.0000363 -0.1547763 0.3897716 0.0000101 -0.0018527 0.0000089 0.1135541 -0.0000873 -0.001059 -0.00004 -0.1547767 0.4449359 0.208778 -0.0044159 0.2745299 0.0923652 -0.001603 -0.0020384 -0.0012427 -0.1270712 0.444967 -0.2087527 -0.0044456 -0.2744998 0.0923314 0.0016541 -0.0021426 0.0012172 -0.1270685 0.4449313 0.2087807 0.004414 0.274531 0.0923671 0.0016008 0.0020316 0.0012442 -0.1270708 0.4449675 -0.2087525 0.0044492 -0.2745001 0.092329 -0.0016576 0.0021458 -0.0012212 -0.1270695 -0.1141005 0.006153 0.0012734 -0.0546093 0.0201125 -0.0000535 0.0019382 -0.0001037 0.1154191 -0.1141031 -0.0061639 0.0012867 0.0545951 0.0201172 0.0000487 0.0019472 0.0001321 0.1154199 -0.1140996 0.0061527 -0.0012738 -0.0546085 0.0201135 0.0000558 -0.0019376 0.0001031 0.1154194 -0.1141028 -0.0061635 -0.0012869 0.0545964 0.0201172 -0.0000471 -0.0019483 -0.0001298 0.1154193 0.0903081 0.0160708 0.0293023 0.0711637 -0.019278 0.0996586 -0.0265889 0.1258042 -0.033619 -0.1268485 -0.0503453 0.0012053 -0.1271581 0.0489862 0.0005638 0.0014671 0.0001484 0.1155224 0.0894424 0.0149624 -0.0304323 0.0699612 -0.0187729 -0.1002015 0.0251434 -0.1258723 -0.0339304 -0.1268588 0.0503311 0.0012239 0.1271452 0.049 -0.0005938 0.0015084 -0.000179 0.1155216 0.0902981 -0.0160869 0.0292879 -0.0711568 -0.0192244 -0.0996582 -0.0266066 -0.1258034 -0.0336663 0.0894645 -0.0149285 -0.0304624 -0.0699498 -0.0188397 0.1001976 0.025106 0.125877 -0.0338835 -0.1268479 -0.0503454 -0.0012083 -0.1271589 0.0489857 -0.0005667 -0.0014689 -0.0001495 0.1155222 0.0894437 0.0149597 0.0304341 0.0699594 -0.0187727 0.1002025 -0.0251417 0.1258725 -0.0339296 0.090306 0.0160742 -0.0293001 0.071166 -0.0192786 -0.0996578 0.0265911 -0.1258041 -0.0336201 0.0902981 -0.0160879 -0.0292871 -0.071157 -0.0192215 0.0996579 0.0266082 0.1258032 -0.0336699 0.0894646 -0.0149281 0.0304632 -0.0699502 -0.018844 -0.1001983 -0.0251046 -0.1258777 -0.0338797 -0.1268608 0.0503306 -0.0012254 0.1271444 0.0490001 0.0005954 -0.0015114 0.0001799 0.1155218 unknown
polarizability: 280.4788245|0.003678|185.4447178|-0.0000843|-0.0006817|80.726373 unknown
InChI: InChI=1S/C10H12S4/c1-5-6(2)12-9(11-5)10-13-7(3)8(4)14-10/h1-4H3
charge 0 multiplicity 1
26 atoms
S  1.680214 -1.536723 0.013858
S  1.680096 1.536869 0.01418
S  -1.680218 1.536741 0.013844
S  -1.680094 -1.536851 0.014207
C  0.679249 0.000037 0.01329
C  -0.679249 -0.000015 0.013293
C  3.309562 -0.680688 0.000384
C  3.309506 0.680968 0.000596
C  -3.309561 0.680705 0.000377
C  -3.309505 -0.680951 0.000608
C  4.496051 -1.612014 -0.008372
C  4.495927 1.612386 -0.007924
C  -4.496053 1.612028 -0.008393
C  -4.495924 -1.612371 -0.007902
H  4.495276 -2.267075 0.883197
H  5.443904 -1.049739 -0.013603
H  4.484028 -2.264895 -0.901444
H  5.443819 1.050181 -0.013364
H  4.495172 2.267261 0.88379
H  4.483781 2.265452 -0.90085
H  -5.443904 1.04975 -0.013639
H  -4.48402 2.264912 -0.901462
H  -4.495292 2.267085 0.883179
H  -4.495172 -2.267232 0.883822
H  -4.483775 -2.265452 -0.900817
H  -5.443818 -1.050169 -0.013354
