program: Gaussian 09
title: 000142737
version: EM64L-G09RevD.01
frameworkgroup: C1[X(C8H10S)]
method: RPBEPBE
basis: SDD
operation: Freq
keyword: #pfreq=noraman
keyword: PBEPBE/SDD
title: #p freq=noraman PBEPBE/SDD
converged: NO YES NO NO
title: Mulliken charges:
elementType: S C C C C C C C C H H H H H H H H H H
charge: 0.195370 -0.388864 -0.407145 -0.547412 -0.537001 -0.107569 -0.105921 -0.194808 -0.202792 0.246798 0.228901 0.245297 0.224570 0.261431 0.263004 0.219139 0.211488 0.200428 0.195085
chargesum: 0.00000
title: Mulliken charges with hydrogens summed into heavy atoms:
elementType: S C C C C C C C C
charge: 0.195370 0.086834 0.062722 -0.285981 -0.273996 0.111570 0.105568 0.005620 -0.007707
polarizability: 1.01457662e+02 -3.16278185e+00 1.06900141e+02 3.94268730e+00 -1.63745892e-01 7.62849147e+01
1716.lowfreq: -21.1270 -0.0022 -0.0012 0.0018 5.0471 11.2216 114.7361 205.6524 234.5884
frequency: 114.5803 205.6498 234.5786 291.9643 359.4887 408.4141 439.0133 504.8488 565.8809 602.0778 645.6326 709.9122 750.8274 788.7148 807.7317 831.1784 849.8587 882.7493 921.5203 965.9604 988.0730 999.9495 1027.8016 1049.3679 1095.4758 1133.0730 1164.1758 1176.5189 1223.5006 1241.5107 1260.1024 1286.2755 1303.3153 1310.3289 1324.3784 1383.1704 1421.6654 1448.4132 1470.3261 1612.9064 1635.6767 2990.5533 3015.1992 3043.2258 3052.5878 3065.2840 3072.8612 3084.5092 3090.6874 3104.2460 3125.0195
redmass: 2.1615 4.7055 2.7846 4.1314 3.1922 2.7753 5.6655 4.5399 5.1402 3.4126 2.2763 1.8155 3.0522 2.0220 2.3476 3.0220 2.2459 2.9855 2.6870 1.3025 1.3704 2.1241 2.4919 1.8684 1.7977 1.4425 1.1727 1.1113 1.2338 1.0831 1.1392 1.3504 1.3576 1.3252 1.3001 1.3556 1.6004 1.0883 1.0869 8.7184 5.4045 1.0586 1.0612 1.0865 1.1003 1.0890 1.0837 1.1001 1.0890 1.0935 1.0972
irintensity: 0.1262 1.1821 0.2453 1.5510 3.1596 9.6295 1.2657 0.8912 3.5920 1.7612 10.8761 72.3003 1.9779 2.3552 12.0841 1.7571 17.9884 7.9825 10.8724 1.1801 0.0680 0.0684 0.7555 1.4617 0.0605 0.5680 0.9880 5.8005 2.2455 1.3369 0.6676 0.3529 5.0100 2.7152 3.3194 6.6062 0.9326 8.3927 6.7131 4.5659 0.4543 31.3680 40.9165 10.9866 9.3998 9.9452 6.0681 33.6492 9.6706 61.5549 45.0681
temp: 298.150 k
press: 1.00000 atm
elementType: 16 6 6 6 6 6 6 6 6 1 1 1 1 1 1 1 1 1 1
symmnumber: 1
zpe: 413194.7 jmol-1
zpe.correction: 0.157378 hartree
zpe.thermalcorrener: 0.165017 hartree
zpe.thermalcorrenthalpy: 0.165961 hartree
zpe.thermalcorrgfe: 0.125332 hartree
zpe.sumelectzpe: -708.197907 hartree
zpe.sumelectthermal: -708.190268 hartree
zpe.sumelectthermalent: -708.189323 hartree
zpe.sumelectthermalfe: -708.229952 hartree
dipole: 0.1721 0.4394 1.9268
dipole: 1.9838
quadrupole: -58.7853 -54.7530 -65.8948
quadrupole: -1.4354 -1.6502 -1.3710
quadrupole: 1.0257 5.0580 -6.0837 -1.4354 -1.6502 -1.3710
hfenergy: -708.3552842 hartree
pointgroup: C01 [X(C8H10S1)]
dipole: -0.0621344 -0.0496437 -0.7764098 debye
dipolederiv: -0.3632434 0.0469289 0.0381244 -0.0112903 -0.1474585 -0.0122992 0.1398811 -0.0235322 -0.2988381 0.0277695 -0.0707935 -0.0122082 -0.0993902 0.0190315 0.0422754 0.0352111 -0.0509322 0.0344443 0.0855266 0.0172942 -0.0178372 0.0076436 0.004195 0.0190969 -0.0219328 0.0707272 0.0468524 0.1413856 -0.136142 -0.0838745 -0.046282 0.2004056 -0.1457364 -0.0705093 -0.0486615 0.1838882 0.102285 0.0799677 -0.0001422 0.0202454 0.1640361 0.1616649 -0.0591418 -0.0055123 0.2155377 0.16756 0.0768239 -0.0541038 0.0817042 -0.0774854 0.0665342 -0.1075533 0.1326005 -0.1984154 0.0844607 -0.0706036 -0.1025396 -0.0684563 -0.0267281 0.0028315 -0.1702456 0.0421545 -0.2431407 0.0638745 0.1612201 0.0071288 0.1547426 0.0082947 -0.0423022 0.0430392 -0.0318972 -0.1919643 -0.0515054 -0.1337213 -0.058437 -0.123165 0.1577189 0.0936481 -0.0522722 0.0777294 -0.1146473 -0.0083573 -0.0288963 0.1078562 -0.0029694 0.0459278 -0.0335791 0.061357 0.0076241 -0.0559097 -0.0506176 0.1135354 -0.0845708 0.1053016 -0.0188294 0.0685682 -0.0590462 0.0496587 0.0300202 -0.1651812 -0.032209 0.0312365 0.0511382 0.0672021 0.0124812 0.0734131 0.0133964 0.0584545 0.0956978 0.0089855 -0.0068468 -0.0382086 -0.0006196 -0.1081515 -0.0341583 -0.1129221 -0.102271 0.032815 0.0409006 0.0168769 0.0426939 -0.1191241 -0.0257588 0.017978 -0.0176664 0.037292 0.0343202 -0.0555245 0.0378045 -0.0544545 -0.0724309 0.0417533 0.049024 0.0481557 0.0306885 -0.0026629 -0.0770439 0.0166481 -0.0968034 -0.0900072 -0.0372052 -0.0001645 -0.0571544 0.1552372 0.0462777 0.0214482 0.0508943 0.0356766 -0.1447414 -0.0454492 0.0497354 -0.0386019 0.1397442 -0.1522768 -0.065713 0.0354909 -0.0379654 0.0441099 -0.0106927 0.0319599 -0.0093447 0.1480549 -0.088128 0.1035425 0.0784994 0.0798389 -0.013497 -0.0476794 0.0734253 -0.0458217 0.1249723 unknown
polarizability: 98.824593|3.887769|106.8796992|-7.6322158|3.4827326|78.9384252 unknown
InChI: InChI=1S/C8H10S/c1-2-4-8-6-5-7(3-1)9-8/h1-4,7-8H,5-6H2
charge 0 multiplicity 1
19 atoms
S  -0.860552 0.194609 1.67675
C  -1.168637 0.83629 -1.039172
C  -1.74383 -0.581658 -0.746507
C  -0.454805 1.412832 0.233345
C  -0.887894 -1.202298 0.382867
C  1.042577 1.529394 0.082815
C  0.478808 -1.658527 -0.082499
C  1.904033 0.498362 -0.199364
C  1.618645 -0.933892 -0.342369
H  -0.431173 0.779584 -1.858015
H  -1.978008 1.514454 -1.363709
H  -2.789559 -0.513791 -0.39527
H  -1.720947 -1.209417 -1.658175
H  -0.891423 2.377591 0.536232
H  -1.417165 -2.041614 0.867474
H  1.473681 2.530809 0.222646
H  0.553255 -2.745918 -0.239443
H  2.964518 0.763503 -0.314526
H  2.482776 -1.526411 -0.67798
