program: Gaussian 09
title: 000142729
version: EM64L-G09RevD.01
frameworkgroup: C1[X(C6H12N2O2)]
method: RPBEPBE
basis: SDD
operation: Freq
keyword: #p
keyword: freq=noraman
keyword: PBEPBE/SDD
title: #p freq=noraman PBEPBE/SDD
converged: YES YES NO NO
title: Mulliken charges:
elementType: O O N N C C C C C C H H H H H H H H H H H H
charge: -0.317901 -0.307884 -0.149117 -0.299376 -0.342501 -0.343966 -0.399336 -0.400206 0.309288 -0.490066 0.220332 0.251394 0.250138 0.224525 0.192353 0.216667 0.217963 0.195355 0.271241 0.238351 0.223785 0.238960
chargesum: 0.00000
title: Mulliken charges with hydrogens summed into heavy atoms:
elementType: O O N N C C C C C C
charge: -0.317901 -0.307884 -0.149117 -0.028135 0.129225 0.130696 0.009684 0.013112 0.309288 0.211031
polarizability: 1.07047089e+02 3.27890634e-01 8.41971204e+01 -2.85831257e+00 -9.84702192e-01 6.22812243e+01
1716.lowfreq: -16.6361 -0.0012 -0.0007 -0.0005 5.5959 11.7980 51.6751 91.6255 102.0181
frequency: 51.3424 91.5869 102.0121 148.6284 162.2845 251.1936 263.9301 329.3218 338.0795 402.7380 443.1083 487.2933 518.6361 608.8004 669.9713 690.9787 742.9382 841.8940 852.9434 902.6190 934.5609 1008.7657 1048.3696 1052.2623 1068.8417 1108.6658 1118.8848 1146.5366 1155.7403 1165.2848 1197.2448 1223.5340 1261.4425 1278.2700 1317.3638 1335.2117 1357.3939 1380.1732 1396.4996 1439.6161 1443.4043 1449.9835 1457.1907 1458.8052 1463.7904 1469.0627 1471.8216 1646.4059 2871.0357 2877.8818 2980.5383 2984.2598 2999.3775 3042.4475 3048.0973 3096.8818 3099.2630 3120.9582 3137.0772 3469.3593
redmass: 3.5553 1.2682 3.9952 2.7577 3.2874 2.2049 2.5035 3.6186 4.1697 2.1075 2.8704 2.2255 3.0445 3.0427 1.6896 9.7833 4.9599 1.5310 3.2809 2.8337 2.9729 3.0262 2.2802 1.7208 2.5516 2.4350 1.2561 1.4507 2.9165 2.1768 1.0954 1.6128 2.1087 1.2883 1.2438 1.2240 1.3266 1.5513 1.7830 1.3815 1.3311 1.0530 1.0816 1.0789 1.1261 1.1047 1.0601 9.3058 1.0711 1.0696 1.0684 1.0672 1.0295 1.0899 1.0911 1.0962 1.1045 1.0940 1.1045 1.0755
irintensity: 0.5211 0.1755 4.3482 7.9677 0.3865 8.1250 5.9668 18.5308 3.2881 0.1921 0.3533 52.7778 52.0858 14.1820 65.7730 24.3524 10.7648 0.4836 6.4928 10.9335 13.1294 4.5143 88.3553 3.3287 35.3798 75.2434 0.4759 49.8877 28.0473 6.6610 1.7977 238.1177 33.5401 21.4297 38.1840 3.8318 12.8877 6.1131 53.6219 108.5559 4.4503 13.6147 10.3299 3.4970 30.4154 1.7986 9.4640 406.6795 63.6132 130.0949 21.6321 75.2693 48.8819 54.0173 46.7182 5.9683 32.5597 6.0656 19.9941 0.4531
temp: 298.150 k
press: 1.00000 atm
elementType: 8 8 7 7 6 6 6 6 6 6 1 1 1 1 1 1 1 1 1 1 1 1
symmnumber: 1
zpe: 487374.2 jmol-1
zpe.correction: 0.185631 hartree
zpe.thermalcorrener: 0.195887 hartree
zpe.thermalcorrenthalpy: 0.196831 hartree
zpe.thermalcorrgfe: 0.149622 hartree
zpe.sumelectzpe: -494.974484 hartree
zpe.sumelectthermal: -494.964228 hartree
zpe.sumelectthermalent: -494.963284 hartree
zpe.sumelectthermalfe: -495.010493 hartree
dipole: -1.7030 -2.1127 -0.7211
dipole: 2.8078
quadrupole: -51.6073 -61.9327 -60.0892
quadrupole: -5.5297 2.9299 1.1185
quadrupole: 6.2691 -4.0563 -2.2128 -5.5297 2.9299 1.1185
hfenergy: -495.1601149 hartree
pointgroup: C01 [X(C6H12N2O2)]
dipole: 0.6845329 -0.8138179 0.2990421 debye
dipolederiv: -1.3066209 -0.3209056 0.1223313 -0.7194376 -0.8046401 0.0776453 0.1472703 0.0297752 -0.3295245 -0.890286 0.2301854 0.0720275 0.3378377 -0.9930422 -0.0677422 0.1224328 -0.0792156 -0.3703025 -1.4548687 0.1251024 0.114076 0.1016979 -0.5360314 -0.0192316 0.0490566 -0.009807 -0.3679208 -0.4637845 -0.0207039 0.1569837 -0.0231928 -0.5373707 -0.0232447 0.250177 -0.0354169 -0.5233798 0.1737091 -0.2100725 -0.0436495 -0.3273632 0.3671239 0.0730089 -0.0416862 0.0766453 0.3058205 0.3219408 0.2287323 -0.0478305 0.3843194 0.2212351 -0.0650046 -0.0348919 -0.0681789 0.2806233 0.3077598 0.2367155 -0.1366514 0.1930696 0.3156175 -0.0636929 -0.0690995 -0.0116844 0.3299114 0.1974609 -0.1900024 -0.126072 -0.1537316 0.4227521 0.1024008 -0.0718249 0.0348336 0.3341083 2.3118076 -0.1131795 -0.2888443 0.1802169 1.3874033 0.0250495 -0.3649508 0.0869471 0.3024378 0.7915846 0.1213066 -0.0723286 0.0316511 0.2363048 -0.0091207 -0.094378 -0.0272755 0.3004595 0.0068763 0.0835808 0.0719834 0.0830113 0.0241801 0.0229123 0.0689013 -0.0681838 -0.1661362 0.0570581 -0.0889741 0.0018762 -0.0649773 -0.0041319 0.0126612 0.0123639 0.0313794 0.0958592 0.0923266 0.0919527 0.0039576 0.0148496 -0.0211371 -0.0155657 0.0022686 -0.0418642 0.0932199 -0.033845 -0.0681439 0.0587927 -0.0734707 0.0700424 -0.0288895 0.0758835 0.0549693 -0.160889 -0.0349683 -0.1071727 0.0970077 -0.0429311 0.005968 -0.0186798 0.0819102 0.1052949 -0.2431457 -0.0238235 0.1083365 0.0168039 0.0810747 -0.1497542 -0.0275979 0.0306019 -0.0499603 0.0782087 -0.0823624 -0.1298699 0.0143444 -0.1008876 -0.08957 0.0109908 0.0362914 0.0282448 0.0829012 0.0097661 0.1004433 0.1060127 0.0383251 -0.0268077 0.0066195 0.0525043 -0.1070536 -0.2440939 0.0781247 0.0051388 -0.1144107 0.0088347 0.0865643 0.0128627 -0.2643601 0.0322044 0.2179539 -0.0209194 -0.0248887 0.0100741 0.067868 0.071786 -0.1030676 0.0709179 -0.0598178 -0.0947603 0.0209301 -0.061336 0.012909 -0.1311147 -0.0988734 0.0094386 0.0111512 -0.0009017 0.1157902 -0.057866 0.0037549 -0.0293933 0.1143507 0.0523811 0.0882474 -0.0705395 0.0790658 -0.0371412 unknown
polarizability: 107.0607247|0.0364933|84.2186072|-2.8037322|0.5500783|62.2461016 unknown
InChI: InChI=1S/C6H12N2O2/c1-10-6(9)8-4-2-7-3-5-8/h7H,2-5H2,1H3
charge 0 multiplicity 1
22 atoms
O  -2.019691 -0.82642 0.010421
O  -1.796025 1.512082 0.11108
N  0.051492 0.128005 -0.332701
N  2.815856 -0.273545 0.123721
C  0.638236 -1.212209 -0.546816
C  0.989237 1.261737 -0.476803
C  1.875118 -1.390248 0.361176
C  2.215494 1.043606 0.433412
C  -1.276014 0.374292 -0.06072
C  -3.45449 -0.629731 0.295558
H  0.957849 -1.301845 -1.604752
H  -0.123158 -1.97567 -0.333783
H  0.4530 2.187748 -0.215287
H  1.328406 1.322106 -1.530313
H  1.526945 -1.444974 1.422838
H  2.373604 -2.344554 0.111338
H  2.959529 1.836829 0.237778
H  1.883798 1.129335 1.497874
H  3.728211 -0.415215 0.57307
H  -3.592541 -0.126367 1.267594
H  -3.876569 -1.645304 0.313954
H  -3.926987 -0.019356 -0.492742
