program: Gaussian 09
title: 000142719
version: EM64L-G09RevD.01
frameworkgroup: C1[X(C23H26)]
method: RPBEPBE
basis: SDD
operation: Freq
keyword: #p
keyword: freq=noraman
keyword: PBEPBE/SDD
title: #p freq=noraman PBEPBE/SDD
converged: YES YES NO NO
title: Mulliken charges:
elementType: C C C C C C C C C C C C C C C C C C C C C C C H H H H H H H H H H H H H H H H H H H H H H H H H H
charge: 0.254054 0.152429 -0.505672 0.514909 -0.527496 -0.769933 -0.457388 -0.451301 -0.787318 -0.472309 -0.433029 0.394399 0.417095 -0.388493 -0.361491 -0.418864 -0.427400 -0.249279 -0.256681 -0.253328 -0.249776 -0.249667 -0.246663 0.229424 0.202705 0.197904 0.225825 0.240945 0.238558 0.197609 0.200725 0.204410 0.206079 0.215036 0.220057 0.226023 0.213481 0.211553 0.209304 0.241525 0.243865 0.265023 0.242637 0.222574 0.223288 0.221515 0.221355 0.225392 0.226389
chargesum: 0.00000
title: Mulliken charges with hydrogens summed into heavy atoms:
elementType: C C C C C C C C C C C C C C C C C C C C C C C
charge: 0.254054 0.152429 -0.073542 0.514909 -0.103767 -0.290431 -0.059054 -0.040812 -0.126201 -0.258828 -0.012171 0.394399 0.417095 -0.146969 -0.117626 -0.153841 -0.184763 -0.026705 -0.033393 -0.031813 -0.028421 -0.024275 -0.020275
polarizability: 2.69426186e+02 -1.88292371e+01 2.35354219e+02 -1.30193109e+01 1.67659336e+01 1.98943064e+02
1716.lowfreq: -12.8617 -5.5650 -0.0007 -0.0005 -0.0005 4.9563 35.5752 41.6350 50.1732
frequency: 35.5136 41.5275 50.1681 64.8738 74.9783 92.1063 129.0064 181.7595 186.9816 213.2174 220.7640 239.5485 251.0159 273.1748 284.1496 300.2908 320.5918 350.6934 359.9711 401.7216 404.2460 405.3660 433.8515 450.6062 462.6216 498.1588 530.8926 537.8205 551.8230 603.4388 616.5168 616.9381 631.7253 655.0497 678.0751 698.4391 706.5368 707.7729 764.9006 773.6091 805.3086 811.1309 822.7788 852.5871 854.8919 859.3048 873.9151 892.2567 899.2772 915.7645 923.9607 938.3921 955.0629 964.0141 976.3840 977.3064 983.6897 990.0132 992.2279 993.4564 993.6834 1011.4454 1023.1492 1027.3797 1032.2739 1042.9035 1070.4737 1086.1091 1093.4623 1104.4497 1124.5374 1134.7476 1146.9862 1153.6952 1171.7189 1172.1926 1177.9913 1186.3425 1194.8490 1197.6535 1199.0623 1209.2744 1214.9641 1250.9515 1273.6869 1289.5231 1303.9507 1321.2673 1325.0493 1327.7683 1333.8359 1336.3770 1341.6455 1347.9092 1366.0537 1375.2114 1377.4154 1386.5865 1432.0535 1432.3856 1453.3210 1455.9076 1459.5316 1464.9352 1470.0610 1475.8445 1477.4175 1482.2689 1484.8416 1495.2648 1586.3784 1588.7969 1608.5928 1611.9318 1671.8133 2941.6031 2956.8156 2963.5580 2970.9354 2974.3364 2983.5821 2987.0007 3000.2875 3021.0190 3026.5175 3028.0017 3041.9627 3044.5906 3067.1208 3067.8474 3079.0642 3116.2278 3117.1354 3124.0166 3124.3167 3137.7183 3137.9960 3151.0497 3156.4002 3162.9823 3176.2845
redmass: 3.8348 3.8312 3.6941 4.3752 3.5533 3.9182 2.6807 3.8978 1.3341 2.9587 2.9132 3.7729 2.9366 3.3948 1.9650 3.6950 2.6955 2.1308 2.3797 2.7738 2.7835 2.2260 3.4235 3.0688 3.5357 3.3690 3.0316 2.9166 3.0743 3.5617 6.2818 6.3545 3.6587 3.5380 2.9255 3.9091 1.6160 1.6507 1.9467 2.0954 1.3917 2.3067 2.1082 1.2513 1.2498 2.0305 1.7526 2.0106 2.0084 1.6281 1.5588 2.0019 2.0633 2.0557 1.4390 1.4543 1.7712 3.4852 4.7747 1.3144 1.5602 2.2340 2.2005 2.1123 2.1411 1.8634 2.0344 1.6386 1.6184 1.7319 1.9043 2.4867 1.7980 2.0940 1.0532 1.0577 1.7374 2.3713 2.0804 1.3767 1.1306 1.5189 1.5353 1.3390 1.3964 1.5659 1.5148 1.4010 1.5494 1.3831 1.4077 1.6288 1.4481 1.4000 1.4567 5.4305 6.6430 1.3097 2.2178 2.2631 1.0838 1.0853 1.0965 1.0766 1.0904 1.0898 1.0905 2.0279 2.0941 1.0714 5.8199 5.9258 5.9624 5.9409 7.5710 1.0650 1.0641 1.0598 1.0562 1.0409 1.0697 1.0607 1.0866 1.0992 1.0961 1.0993 1.1024 1.1023 1.0977 1.0896 1.0984 1.0849 1.0847 1.0874 1.0877 1.0932 1.0937 1.0946 1.0990 1.1002 1.0944
irintensity: 0.0989 0.0489 0.0302 0.0506 0.0520 0.1062 0.4124 0.2271 0.2291 0.1381 0.7141 0.1375 1.5668 0.7604 0.7482 0.3927 0.1488 0.7501 0.3860 0.4347 0.0217 0.3917 0.1070 1.6548 0.8404 2.1538 9.6278 4.6714 8.5418 15.0867 0.2304 0.2784 7.9285 0.9394 1.0377 1.4933 56.1894 57.9738 42.1956 26.1046 13.3323 0.4310 4.7068 0.2049 0.2028 3.9389 3.2186 1.0606 9.2390 2.8366 6.4050 5.5211 1.7307 2.4953 0.6565 0.4638 8.0280 0.6067 0.5699 0.5101 0.2047 10.5453 10.7941 10.9595 10.2580 1.7441 4.7104 0.7001 7.3808 1.9298 0.6116 1.1186 5.6396 2.8375 0.0255 0.1126 3.1704 2.8998 1.3551 3.5462 1.5080 3.6403 2.8319 1.8902 1.0964 1.5897 2.0760 1.1212 0.3313 0.7378 2.1376 0.9997 2.6056 1.7470 5.2419 2.6162 1.4036 14.0384 1.9143 10.5172 1.0821 15.0402 5.3806 10.3236 2.8186 7.2144 28.3206 28.4622 15.1117 12.3359 3.5082 0.0262 13.7658 8.0749 2.8943 43.7571 19.3384 15.8091 51.9595 26.1541 20.7545 37.6451 61.3558 31.2566 41.4960 24.9855 28.6296 97.3558 33.6496 37.5787 34.7866 3.8800 5.2252 1.9765 3.2560 2.9513 57.1258 38.6584 33.8515 21.3038 8.6983
temp: 298.150 k
press: 1.00000 atm
elementType: 6 6 6 6 6 6 6 6 6 6 6 6 6 6 6 6 6 6 6 6 6 6 6 1 1 1 1 1 1 1 1 1 1 1 1 1 1 1 1 1 1 1 1 1 1 1 1 1 1
symmnumber: 1
zpe: 1106656.1 jmol-1
zpe.correction: 0.421503 hartree
zpe.thermalcorrener: 0.441280 hartree
zpe.thermalcorrenthalpy: 0.442225 hartree
zpe.thermalcorrgfe: 0.373747 hartree
zpe.sumelectzpe: -890.373977 hartree
zpe.sumelectthermal: -890.354199 hartree
zpe.sumelectthermalent: -890.353255 hartree
zpe.sumelectthermalfe: -890.421732 hartree
dipole: -0.6436 -0.2113 -0.2516
dipole: 0.7226
quadrupole: -132.1557 -134.5320 -133.5417
quadrupole: -2.0951 -1.7240 4.2859
quadrupole: 1.2541 -1.1222 -0.1319 -2.0951 -1.7240 4.2859
hfenergy: -890.7954797 hartree
pointgroup: C01 [X(C23H26)]
dipole: 0.2501353 0.0929025 -0.0981309 debye
polarizability: 270.7875848|-16.8792037|233.2580274|14.6393588|-16.8195198|199.6778568 unknown
InChI: InChI=1S/C23H26/c1-22-15-9-8-14-21(22)18-23(17-16-22,19-10-4-2-5-11-19)20-12-6-3-7-13-20/h2-7,10-14H,8-9,15-18H2,1H3
charge 0 multiplicity 1
49 atoms
C  2.449501 1.044398 -0.703827
C  -0.535241 0.27542 -0.222717
C  1.524049 0.373112 -1.768285
C  1.888742 0.734821 0.69361
C  0.034851 0.738688 -1.602529
C  0.384763 0.907767 0.888457
C  3.886648 0.463115 -0.848307
C  4.787871 0.789874 0.362267
C  2.485601 2.587015 -0.934779
C  2.687401 0.355479 1.73043
C  4.193587 0.188416 1.657173
C  -0.581196 -1.275499 -0.19968
C  -1.972447 0.804503 0.032603
C  -1.479587 -1.938623 -1.080948
C  -2.670529 0.353449 1.186649
C  0.218522 -2.075294 0.653738
C  -2.62019 1.746238 -0.806127
C  -1.569349 -3.344984 -1.117137
C  -3.958934 0.832062 1.499316
C  0.127802 -3.487924 0.626179
C  -3.916184 2.226346 -0.499705
C  -0.762088 -4.131272 -0.260228
C  -4.5908 1.776762 0.655623
H  1.638962 -0.726743 -1.701896
H  1.866896 0.673262 -2.779104
H  -0.077894 1.835718 -1.694798
H  -0.553426 0.286805 -2.423836
H  0.089522 0.531534 1.886218
H  0.143987 1.99148 0.892435
H  4.341339 0.846112 -1.783934
H  3.815491 -0.639292 -0.95224
H  4.88191 1.887127 0.475361
H  5.810391 0.400692 0.195053
H  2.79401 2.80932 -1.974671
H  1.502788 3.060878 -0.764291
H  3.203447 3.073001 -0.250991
H  2.218754 0.132472 2.702516
H  4.666085 0.650876 2.547381
H  4.440633 -0.894311 1.717403
H  -2.13185 -1.341511 -1.729893
H  -2.202358 -0.39777 1.834134
H  0.930671 -1.60321 1.334465
H  -2.127371 2.110878 -1.71234
H  -2.2733 -3.828201 -1.804561
H  -4.47336 0.465468 2.395116
H  0.757612 -4.08302 1.298038
H  -4.39671 2.951238 -1.167241
H  -0.831238 -5.224794 -0.282219
H  -5.593683 2.149221 0.893018
