program: Gaussian 09
title: 000142705
version: EM64L-G09RevD.01
frameworkgroup: C1[X(C20H30)]
method: RPBEPBE
basis: SDD
operation: Freq
keyword: #p
keyword: freq=noraman
keyword: PBEPBE/SDD
title: #p freq=noraman PBEPBE/SDD
converged: YES YES NO YES
title: Mulliken charges:
elementType: C C C C C C C C C C C C C C C C C C C C H H H H H H H H H H H H H H H H H H H H H H H H H H H H H H
charge: 0.414659 0.427636 -0.034418 0.020304 0.090270 0.121632 0.480347 -0.673741 0.074934 -0.556768 -0.560341 -0.705216 -0.705259 -0.723503 -0.714248 -0.714282 -0.731716 -0.707014 -0.707041 -0.733261 0.255748 0.262853 0.246173 0.225941 0.211896 0.222627 0.222626 0.225931 0.211901 0.219814 0.219824 0.208835 0.223174 0.207477 0.228078 0.228087 0.223174 0.207480 0.216124 0.216115 0.215180 0.223788 0.209100 0.212914 0.212899 0.223792 0.209105 0.215654 0.215645 0.215073
chargesum: 0.00000
title: Mulliken charges with hydrogens summed into heavy atoms:
elementType: C C C C C C C C C C C C C C C C C C C C
charge: 0.414659 0.427636 -0.034418 0.020304 0.090270 0.121632 0.480347 -0.417992 0.074934 -0.293915 -0.314168 -0.044751 -0.044801 -0.075031 -0.055519 -0.055542 -0.084298 -0.061212 -0.061245 -0.086889
polarizability: 2.83925564e+02 -1.61655768e+01 2.36483500e+02 2.09053712e-03 -4.05139900e-04 1.56034969e+02
1716.lowfreq: -5.0527 -3.0357 -0.0006 -0.0004 0.0003 5.8758 30.1232 38.4692 43.3033
frequency: 30.0646 38.3610 43.0937 63.8561 93.2172 104.0290 116.3526 126.6921 182.0721 193.1729 196.3967 200.8750 208.8236 230.8371 232.6799 243.1208 250.0809 255.5891 264.6584 271.7628 273.7548 276.7697 291.5940 304.2770 319.6737 332.3072 339.7234 355.6768 360.6030 387.0955 388.9981 418.8661 422.5519 466.3029 525.1155 545.3685 564.2301 569.6918 633.8394 634.3075 687.7751 731.9720 745.8745 769.3191 801.6366 820.5116 824.5407 836.3006 873.3919 880.5824 902.2970 915.1666 917.5445 919.5901 927.8858 928.5473 930.4332 937.8538 941.5609 944.0182 1004.4569 1011.8976 1012.5597 1018.1556 1019.7412 1019.9131 1033.1272 1081.3843 1085.7531 1112.1964 1190.2425 1193.4547 1198.3675 1201.5331 1201.7638 1208.2510 1217.5802 1239.4800 1248.5002 1280.0683 1302.7402 1308.6772 1358.9061 1367.7318 1369.1056 1369.9803 1370.1097 1372.4666 1372.7851 1396.8303 1396.9981 1397.9388 1453.4165 1454.6266 1455.3379 1464.1103 1465.8077 1466.4415 1467.2111 1467.7112 1468.3200 1473.5288 1475.1294 1477.2204 1478.8854 1479.4770 1479.8598 1491.6360 1493.3054 1496.5434 1523.5620 1546.6657 1586.2258 1613.9174 2968.0853 2969.3327 2972.3424 2972.6191 2973.2850 2974.0594 2974.8357 2978.0215 2979.2842 3062.1413 3065.0504 3066.5200 3068.6160 3068.9746 3069.3515 3069.5286 3071.6736 3072.8088 3075.9349 3076.6354 3076.6696 3077.2283 3078.0783 3082.3249 3082.9710 3083.1430 3086.6256 3155.2266 3185.2716 3203.8443
redmass: 2.7639 2.7510 2.8500 3.3859 3.4749 3.2528 3.2624 3.1384 1.2713 1.4879 2.6420 1.0532 1.3412 1.1294 2.8301 1.3896 2.2159 1.1676 1.6413 2.0842 1.0404 1.1625 1.0382 2.8057 2.6016 2.5570 2.5635 2.5624 2.2961 2.6079 2.5673 2.6950 3.1052 3.0848 2.5598 3.0123 3.2476 4.5541 3.7466 2.7309 3.0526 4.9835 4.8329 4.3320 2.9483 2.8989 1.5814 1.5826 3.4418 1.5661 3.5866 1.7465 1.7732 1.7862 1.6562 1.6647 1.6424 1.2011 1.1992 1.2005 1.7097 1.3945 1.4607 1.3859 1.4618 1.3843 1.7831 2.2243 2.3147 3.0274 1.5061 2.8247 2.8924 2.9301 2.5682 2.5121 2.8177 2.5169 1.9598 3.3130 3.7488 3.4245 3.7071 1.1794 1.1890 1.1853 1.2092 1.2192 1.2888 1.2096 1.2148 1.2489 1.0507 1.0508 1.0512 1.0485 1.0484 1.0472 1.0463 1.0485 1.0479 1.0581 1.0593 1.0573 1.0524 1.0511 1.0506 1.1159 1.1424 1.0787 5.0753 6.2849 7.2335 8.5464 1.0344 1.0345 1.0349 1.0347 1.0342 1.0343 1.0355 1.0357 1.0352 1.0999 1.0999 1.1003 1.1008 1.0999 1.1002 1.1002 1.1000 1.0986 1.0995 1.0989 1.1011 1.0987 1.0994 1.0996 1.0996 1.0997 1.0987 1.0954 1.0944 1.0955
irintensity: 0.0697 0.1001 0.1950 1.3231 0.1558 0.0054 0.2038 0.0277 0.1854 0.0166 0.6632 0.0160 0.4614 0.0303 0.0698 0.2023 0.1815 0.1484 0.1426 0.0420 0.0119 0.0078 0.0924 0.5205 0.4363 0.1235 0.0062 0.4868 0.0006 0.5320 0.0203 0.2545 0.6524 0.1979 0.6138 0.6058 0.5052 0.0524 2.3038 14.4397 4.0715 0.3088 0.0294 2.7733 6.4896 10.9727 23.6077 9.8741 19.0070 7.7199 23.1823 1.7760 2.2123 1.8875 3.3517 1.2091 2.1685 0.0821 0.0240 0.0010 5.3860 0.0502 16.2480 0.0656 2.4068 0.0860 7.1228 20.3899 24.0093 39.6159 0.4241 7.0412 3.6657 8.3254 25.9632 69.2169 46.9981 21.9914 65.0582 2.3103 12.3417 6.2452 7.4724 14.9728 11.8007 27.7714 25.1086 31.8159 3.4420 17.5857 13.3175 3.1657 0.0472 0.3724 0.0117 0.0062 0.3758 0.0004 2.3258 0.8653 3.0755 12.4192 11.2740 13.9214 3.6919 25.7876 8.0337 24.8445 0.9146 39.7999 0.3753 34.6767 20.1646 131.8489 30.2984 37.5979 30.0053 26.6282 30.9782 48.5524 31.6827 47.1220 26.4810 1.7316 26.5088 3.4719 3.3436 4.6555 3.8126 6.8011 28.5682 133.6677 49.3301 160.1777 3.2486 50.2837 48.2033 16.7253 48.9388 37.6421 54.1142 15.7519 15.3564 11.2507
temp: 298.150 k
press: 1.00000 atm
elementType: 6 6 6 6 6 6 6 6 6 6 6 6 6 6 6 6 6 6 6 6 1 1 1 1 1 1 1 1 1 1 1 1 1 1 1 1 1 1 1 1 1 1 1 1 1 1 1 1 1 1
symmnumber: 1
zpe: 1150660.4 jmol-1
zpe.correction: 0.438263 hartree
zpe.thermalcorrener: 0.461705 hartree
zpe.thermalcorrenthalpy: 0.462649 hartree
zpe.thermalcorrgfe: 0.387408 hartree
zpe.sumelectzpe: -778.532615 hartree
zpe.sumelectthermal: -778.509173 hartree
zpe.sumelectthermalent: -778.508229 hartree
zpe.sumelectthermalfe: -778.583470 hartree
dipole: -0.4870 0.1338 0.0004
dipole: 0.5051
quadrupole: -117.9737 -117.0404 -128.4336
quadrupole: -1.7603 -0.0005 0.0001
quadrupole: 3.1755 4.1088 -7.2844 -1.7603 -0.0005 0.0001
hfenergy: -778.970878 hartree
pointgroup: C01 [X(C20H30)]
dipole: 0.1909104 -0.055162 0.0003034 debye
polarizability: 283.4930163|-16.7826409|236.9159919|0.0846623|-0.0099844|156.0350254 unknown
InChI: InChI=1S/C20H30/c1-18(2,3)13-10-14-15(11-13)17(20(7,8)9)12-16(14)19(4,5)6/h10-12H,1-9H3
charge 0 multiplicity 1
50 atoms
C  1.329173 -1.214928 0.000539
C  1.439729 1.16173 0.000683
C  0.011342 -0.772422 -0.000179
C  0.014719 0.695227 -0.000161
C  1.896981 -2.625032 0.001166
C  1.901959 2.612774 0.001255
C  -2.201186 -0.078319 -0.001495
C  2.209066 0.014504 0.00104
C  -3.723423 0.017889 -0.002604
C  -1.401138 -1.211978 -0.001013
C  -1.297863 1.127727 -0.000926
C  2.781764 -2.814793 1.273394
C  2.784502 -2.815155 -1.269049
C  0.780314 -3.697877 0.00011
C  1.350874 3.329977 1.272512
C  1.351966 3.330787 -1.269997
C  3.448296 2.712312 0.001954
C  -4.195648 0.790575 -1.272312
C  -4.197533 0.791519 1.265815
C  -4.373823 -1.388518 -0.00256
H  3.299705 -0.021189 0.00162
H  -1.755826 -2.242295 -0.001232
H  -1.660844 2.160105 -0.001081
H  2.178617 -2.700631 2.192218
H  3.225467 -3.82822 1.27131
H  3.605664 -2.080134 1.312652
H  3.608255 -2.080269 -1.30693
H  2.183289 -2.701642 -2.189223
H  3.228521 -3.828437 -1.265533
H  0.140721 -3.606136 -0.896274
H  0.138862 -3.606003 0.895151
H  1.226685 -4.709464 0.000661
H  1.743568 2.857037 2.19097
H  1.655864 4.393725 1.270281
H  0.248376 3.286375 1.314158
H  0.249528 3.286907 -1.312807
H  1.745718 2.85866 -2.188423
H  1.656657 4.394622 -1.266679
H  3.880797 2.229762 -0.893918
H  3.880004 2.229583 0.898112
H  3.759694 3.773238 0.002201
H  -3.894029 0.255784 -2.191243
H  -5.297725 0.892238 -1.272808
H  -3.762281 1.806923 -1.313332
H  -3.76429 1.807921 1.306697
H  -3.897233 0.257462 2.185607
H  -5.299616 0.893128 1.26464
H  -4.079349 -1.965392 0.893668
H  -4.078141 -1.966009 -0.89799
H  -5.475928 -1.298149 -0.003346
