program: Gaussian 09
title: 000142698
version: EM64L-G09RevD.01
frameworkgroup: C1[X(C15H25NO)]
method: RPBEPBE
basis: SDD
operation: Freq
keyword: #p
keyword: freq=noraman
keyword: PBEPBE/SDD
title: #p freq=noraman PBEPBE/SDD
converged: YES YES NO NO
title: Mulliken charges:
elementType: O N C C C C C C C C C C C C C C C H H H H H H H H H H H H H H H H H H H H H H H H H
charge: -0.271638 -0.705121 -0.381424 -0.377793 -0.371426 -0.375166 -0.353681 -0.406709 -0.356283 -0.310781 -0.696641 0.345719 -0.322566 -0.365209 -0.422928 -0.392999 0.496315 0.191786 0.191477 0.195222 0.194642 0.189732 0.190159 0.190459 0.190625 0.187725 0.187618 0.213369 0.213366 0.195068 0.194942 0.199093 0.199375 0.215205 0.209595 0.209637 0.241879 0.243062 0.210917 0.214344 0.299546 0.299488
chargesum: 0.00000
title: Mulliken charges with hydrogens summed into heavy atoms:
elementType: O N C C C C C C C C C C C C C C C
charge: -0.271638 -0.106087 0.001839 0.012071 0.008465 0.005918 0.021663 0.020026 0.033728 0.087687 -0.062204 0.345719 -0.080688 -0.122148 -0.212012 -0.178655 0.496315
polarizability: 2.65554357e+02 -4.61280170e+00 1.60237162e+02 9.62020507e-01 6.71489659e-01 1.10696102e+02
1716.lowfreq: -0.0012 0.0003 0.0013 4.6810 6.0982 19.0461 24.3719 27.5340 42.9634
frequency: 19.4805 27.4001 42.9542 48.7065 75.7114 80.0454 87.4691 121.8573 128.8268 140.6698 150.1914 157.0949 164.4123 165.2153 227.4935 241.4407 275.5890 314.6363 324.2329 334.2648 353.3554 378.3128 414.2677 441.8256 454.0804 498.3238 512.6226 544.3864 637.3646 712.4995 722.8850 728.0332 745.9950 749.6210 778.9884 794.5940 816.8162 828.0172 832.5479 887.6720 892.7112 910.0785 939.2081 960.4873 972.0977 993.5699 995.5518 1011.7294 1015.9668 1019.3524 1043.4267 1066.1562 1076.7537 1080.6595 1092.7310 1125.0256 1127.3708 1148.7118 1176.4443 1186.2019 1212.3172 1215.3573 1217.4728 1251.7130 1254.7603 1277.2676 1282.4420 1287.2838 1290.7359 1297.8385 1299.3429 1303.7447 1311.4250 1324.4822 1347.7319 1355.6949 1359.1181 1374.9572 1389.6469 1391.6092 1438.5371 1462.2894 1462.7341 1466.6728 1468.9086 1473.1834 1476.9376 1478.7405 1484.0879 1488.8545 1491.4667 1512.3932 1586.6214 1632.6632 1647.8115 2931.6889 2950.1481 2950.9149 2953.0466 2956.5477 2963.6624 2968.7858 2971.7596 2983.8097 2985.6513 2989.6042 2992.3018 2997.9111 3011.5876 3026.9236 3039.7056 3059.5556 3068.2223 3070.1983 3118.4643 3121.4565 3158.3363 3162.0914 3574.2274 3715.0583
redmass: 4.1430 4.2601 4.3209 1.7271 4.0996 3.4890 1.5832 2.4031 1.8937 4.3385 2.2202 2.2728 3.2559 4.2921 1.1309 3.4450 1.2027 4.0507 1.0516 3.3654 6.8908 2.8868 2.7853 3.9031 3.2710 3.4046 2.2359 4.9243 6.6939 3.3390 1.0604 1.0773 1.1132 5.5430 1.1522 1.2920 1.6786 5.8716 1.1948 1.8997 1.2147 1.3733 1.3441 1.1788 7.7408 3.8443 2.8401 4.0215 1.4540 1.0948 3.3654 2.8096 2.5437 2.0903 2.2873 2.0478 1.4815 1.4041 1.2352 1.7345 2.6806 1.2977 1.4406 1.3053 1.2971 1.1280 1.0960 1.0669 1.3097 1.0926 1.1299 1.9129 1.8930 1.3743 1.4835 1.6793 1.6246 2.3134 1.2180 2.3797 3.5600 1.0718 1.0733 1.0686 1.0764 1.0830 1.0424 1.0884 1.0991 1.1021 1.1204 2.5998 7.2023 1.3881 3.3222 1.0547 1.0587 1.0588 1.0590 1.0593 1.0590 1.0586 1.0367 1.0965 1.1058 1.0982 1.0593 1.1010 1.1036 1.1048 1.1047 1.1046 1.1007 1.0992 1.0891 1.0886 1.0937 1.0950 1.0446 1.1041
irintensity: 0.0410 0.1597 1.1689 0.0951 0.2893 1.6404 0.1080 0.5736 1.3537 0.3395 0.0747 1.4107 0.0052 0.9394 0.0022 0.7938 329.6345 2.4093 2.4655 0.6621 0.0599 0.9626 0.0004 0.0685 0.3425 0.1099 23.3555 2.8218 0.2018 0.3826 15.3793 0.0641 6.8039 44.3501 1.9913 11.5536 85.9718 0.1327 0.1516 4.7182 0.9555 0.0279 0.1327 0.2149 63.7077 1.9015 14.4730 16.9304 0.3365 0.2516 3.3828 3.4935 5.4130 0.0843 14.4047 15.0021 14.8415 0.6409 29.7574 0.3228 322.2984 2.5218 0.1848 0.0128 1.8913 0.0529 0.0029 1.2268 1.0980 0.0033 0.0558 6.1499 12.2658 0.3053 1.8390 0.5086 0.6250 9.9766 11.6760 39.5999 4.9619 0.1053 0.0012 0.0652 0.7539 8.7705 12.3079 4.3035 23.8808 12.5029 63.4024 308.5667 2.0479 72.7643 96.9900 37.0724 0.3642 0.0979 5.9122 0.4466 45.3889 167.0526 37.1328 0.0028 33.0029 1.0099 41.8501 0.6406 1.3805 0.0874 124.6318 107.1072 102.2360 55.6992 17.8511 39.1059 21.8849 2.1951 63.7889 18.3850
temp: 298.150 k
press: 1.00000 atm
elementType: 8 7 6 6 6 6 6 6 6 6 6 6 6 6 6 6 6 1 1 1 1 1 1 1 1 1 1 1 1 1 1 1 1 1 1 1 1 1 1 1 1 1
symmnumber: 1
zpe: 969768.5 jmol-1
zpe.correction: 0.369365 hartree
zpe.thermalcorrener: 0.389357 hartree
zpe.thermalcorrenthalpy: 0.390301 hartree
zpe.thermalcorrgfe: 0.318665 hartree
zpe.sumelectzpe: -715.224441 hartree
zpe.sumelectthermal: -715.204450 hartree
zpe.sumelectthermalent: -715.203506 hartree
zpe.sumelectthermalfe: -715.275142 hartree
dipole: -0.9530 1.6654 -0.0089
dipole: 1.9188
quadrupole: -78.1520 -101.4635 -109.7364
quadrupole: -6.7006 0.4473 0.2772
quadrupole: 18.2986 -5.0129 -13.2857 -6.7006 0.4473 0.2772
hfenergy: -715.5938068 hartree
pointgroup: C01 [X(C15H25N1O1)]
dipole: 0.374224 -0.6265345 -0.193137 debye
polarizability: 265.544757|-4.2648174|156.4619411|-2.2334977|13.1796635|114.4809224 unknown
InChI: InChI=1S/C15H25NO/c1-2-3-4-5-6-7-8-13-17-15-11-9-14(16)10-12-15/h9-12H,2-8,13,16H2,1H3
charge 0 multiplicity 1
42 atoms
O  2.071173 0.803094 0.313064
N  7.495116 -0.755779 -0.211901
C  -4.153087 -0.382429 -0.058734
C  -2.902045 0.475651 0.233766
C  -5.479379 0.373751 0.180922
C  -1.5728 -0.27598 -0.003452
C  -6.734789 -0.475982 -0.118354
C  -0.333811 0.604576 0.275898
C  -8.059091 0.284971 0.120055
C  0.980444 -0.146861 0.050269
C  -9.309676 -0.568896 -0.181465
C  3.394106 0.332688 0.159037
C  3.748798 -0.984607 -0.21804
C  4.415773 1.280561 0.41008
C  5.110265 -1.343967 -0.340873
C  5.76938 0.921994 0.287637
C  6.143682 -0.401436 -0.091206
H  -4.131018 -1.293436 0.575645
H  -4.118077 -0.73578 -1.110748
H  -2.938029 0.830977 1.284712
H  -2.924891 1.385183 -0.402199
H  -5.497822 1.287812 -0.449255
H  -5.516228 0.723065 1.234235
H  -1.544143 -1.178876 0.642214
H  -1.542292 -0.640328 -1.051842
H  -6.720188 -1.389654 0.512529
H  -6.699645 -0.826029 -1.171518
H  -0.35877 0.974395 1.319122
H  -0.348407 1.496475 -0.379963
H  -8.093246 0.634599 1.172261
H  -8.072342 1.197649 -0.510433
H  1.048919 -0.519106 -0.99499
H  1.063362 -1.01627 0.73796
H  -10.2416 -0.000153 -0.006547
H  -9.313361 -0.90804 -1.234777
H  -9.338555 -1.470167 0.459925
H  2.983835 -1.740688 -0.419158
H  4.128047 2.296129 0.700353
H  5.369487 -2.369045 -0.633839
H  6.546333 1.670719 0.486136
H  8.227702 -0.075899 -0.035813
H  7.764569 -1.696481 -0.480915
