program: Gaussian 09
title: 000142696
version: EM64L-G09RevD.01
frameworkgroup: C1[X(C12H17Cl)]
method: RPBEPBE
basis: SDD
operation: Freq
keyword: #p
keyword: freq=noraman
keyword: PBEPBE/SDD
title: #p freq=noraman PBEPBE/SDD
converged: NO YES NO YES
title: Mulliken charges:
elementType: Cl C C C C C C C C C C C C H H H H H H H H H H H H H H H H H
charge: -0.084341 -0.225500 -0.238073 0.657234 0.577785 -0.412673 -0.391987 -0.394642 -0.504369 -0.691677 -0.691680 -0.690935 -0.690928 0.232760 0.210141 0.231654 0.257276 0.234527 0.230742 0.214910 0.207743 0.207742 0.214910 0.230742 0.227892 0.213312 0.213113 0.213119 0.213311 0.227890
chargesum: 0.00000
title: Mulliken charges with hydrogens summed into heavy atoms:
elementType: Cl C C C C C C C C C C C C
charge: -0.084341 0.007260 -0.027932 0.657234 0.577785 -0.412673 -0.160333 -0.137366 -0.269842 -0.038281 -0.038285 -0.036618 -0.036608
polarizability: 1.81202077e+02 2.39454783e+00 1.40144566e+02 4.10514168e-04 1.00280953e-03 9.49121536e+01
1716.lowfreq: -13.1900 -1.1840 -0.0029 -0.0024 -0.0011 8.4409 13.3745 26.6549 68.7253
frequency: 11.3021 26.5866 68.7237 125.8759 142.6468 171.9730 182.4719 212.9665 217.1895 224.1981 237.6779 246.6189 292.7588 316.0185 356.3673 384.6232 432.5476 444.6506 461.9026 475.8908 565.4147 624.5905 660.8379 678.4832 742.6895 810.5242 838.6671 885.1436 890.6925 899.3340 916.6114 918.4193 954.5748 955.9180 960.8669 1019.7928 1059.2900 1065.4212 1113.3260 1115.4901 1124.2954 1151.5687 1171.4793 1211.0526 1227.2878 1268.8018 1302.9898 1307.8820 1318.0540 1342.2227 1376.7349 1377.1612 1381.7843 1395.6172 1396.6111 1402.8431 1466.5956 1467.4225 1467.7989 1468.1428 1474.7203 1479.7589 1480.0634 1486.0519 1494.9013 1560.9522 1615.4890 2974.7294 2975.3023 2977.6320 2978.2168 2981.6126 3023.9710 3067.4385 3067.5373 3075.1177 3077.1051 3078.4590 3079.4602 3082.7892 3084.1981 3115.9716 3139.5508 3151.2230
redmass: 2.7919 2.9658 3.0247 3.6128 3.5370 4.6585 2.5171 1.0915 1.1679 2.2696 1.1613 1.1247 3.5683 2.5174 2.9884 8.3067 3.3132 3.0649 3.8642 2.9087 2.7310 3.3880 4.6717 3.6194 3.3078 4.1521 1.4232 1.5189 2.5368 2.7067 1.1819 1.1845 1.4447 1.4544 1.3764 3.2771 1.5954 1.5658 2.5409 2.6418 1.7132 2.0758 1.4649 1.5422 2.5637 1.5463 2.3277 1.3283 1.3017 1.5184 1.1939 1.1948 3.1482 1.2110 1.2969 2.1101 1.0467 1.0443 1.0510 1.0488 1.5632 1.0489 1.0497 1.0601 1.5412 6.3004 7.1806 1.0349 1.0348 1.0354 1.0355 1.0843 1.0847 1.0999 1.1001 1.0992 1.0985 1.1006 1.1005 1.0998 1.0994 1.0867 1.0960 1.0920
irintensity: 0.0075 0.1468 0.4769 0.0227 0.2612 1.1981 0.1308 0.0023 0.0155 0.2654 0.0272 0.1156 0.0249 0.0416 0.2632 5.7941 1.3762 0.5150 6.4386 0.4763 1.9390 13.8592 1.7432 17.2238 1.2150 26.5089 27.6335 12.7978 3.9967 8.1917 3.3829 2.4045 0.1116 0.0068 0.0016 34.1233 18.8430 19.7854 0.7841 2.8608 11.0941 2.8137 0.0838 7.7871 7.0055 0.8419 35.2535 0.7501 0.6560 2.6754 15.0365 16.6776 8.9495 1.1576 8.8836 26.8858 0.0294 1.5284 5.7172 5.5049 0.8294 0.4573 29.8049 0.5064 62.6825 17.2227 11.1661 27.8416 32.8789 55.3044 15.5774 18.0534 0.1887 0.3956 0.4368 115.8039 82.8799 21.2911 25.3352 39.7866 37.2156 13.0666 23.2118 2.7103
temp: 298.150 k
press: 1.00000 atm
elementType: 17 6 6 6 6 6 6 6 6 6 6 6 6 1 1 1 1 1 1 1 1 1 1 1 1 1 1 1 1 1
symmnumber: 1
zpe: 669057.5 jmol-1
zpe.correction: 0.254831 hartree
zpe.thermalcorrener: 0.269552 hartree
zpe.thermalcorrenthalpy: 0.270496 hartree
zpe.thermalcorrgfe: 0.211508 hartree
zpe.sumelectzpe: -926.550275 hartree
zpe.sumelectthermal: -926.535554 hartree
zpe.sumelectthermalent: -926.534609 hartree
zpe.sumelectthermalfe: -926.593598 hartree
dipole: -0.8887 -1.9178 -0.0001
dipole: 2.1138
quadrupole: -78.4090 -86.6749 -89.8609
quadrupole: -1.8295 0.0001 0.0002
quadrupole: 6.5726 -1.6933 -4.8793 -1.8295 0.0001 0.0002
hfenergy: -926.8051058 hartree
pointgroup: C01 [X(C12H17Cl1)]
dipole: 0.3215988 -0.7669129 -0.0002401 debye
polarizability: 180.9698656|-3.9005061|140.3767723|-0.0022669|0.0142771|94.912158 unknown
InChI: InChI=1S/C12H17Cl/c1-8(2)10-5-6-11(9(3)4)12(13)7-10/h5-9H,1-4H3
charge 0 multiplicity 1
30 atoms
Cl -1.151265 2.754648 0.000907
C  -2.880927 0.044551 0.000094
C  3.054722 -0.509034 -0.000097
C  -1.354637 -0.069354 0.000064
C  1.530878 -0.358866 -0.000024
C  -0.47591 1.040642 0.000386
C  -0.724306 -1.343084 -0.000306
C  0.926095 0.92279 0.00035
C  0.67753 -1.490441 -0.000351
C  -3.491473 -0.586487 1.280078
C  -3.491471 -0.585866 -1.280197
C  3.689283 0.101799 1.277998
C  3.68917 0.102284 -1.278022
H  -3.139106 1.119198 0.000354
H  3.278594 -1.595113 -0.000312
H  -1.35733 -2.23848 -0.000566
H  1.540264 1.828873 0.000612
H  1.116984 -2.495163 -0.00064
H  -3.081916 -0.115299 2.191354
H  -4.589364 -0.455069 1.285716
H  -3.281128 -1.67105 1.333914
H  -3.281104 -1.670399 -1.334577
H  -4.589366 -0.454476 -1.285756
H  -3.081938 -0.114216 -2.191244
H  3.265625 -0.352124 2.191702
H  4.783068 -0.060895 1.283303
H  3.51039 1.192065 1.328022
H  3.510195 1.192555 -1.327648
H  4.782964 -0.060341 -1.283454
H  3.265479 -0.351347 -2.191857
