program: Gaussian 09
title: 000142683
version: EM64L-G09RevD.01
frameworkgroup: C1[X(C5H6OS2)]
method: RPBEPBE
basis: SDD
operation: Freq
keyword: #pfreq=noraman
keyword: PBEPBE/SDD
title: #p freq=noraman PBEPBE/SDD
converged: YES YES NO NO
title: Mulliken charges:
elementType: S S O C C C C C H H H H H H
charge: 0.264722 0.264721 -0.110367 -0.061573 -0.061570 -0.731936 -0.731936 -0.285981 0.248650 0.248613 0.229697 0.248647 0.248616 0.229696
chargesum: 0.00000
title: Mulliken charges with hydrogens summed into heavy atoms:
elementType: S S O C C C C C
charge: 0.264722 0.264721 -0.110367 -0.061573 -0.061570 -0.004976 -0.004976 -0.285981
polarizability: 1.12944101e+02 7.48825403e-06 1.03753844e+02 7.12263642e-04 -4.97276255e-03 4.26757895e+01
1716.lowfreq: -6.7979 0.0011 0.0037 0.0041 8.2210 8.5547 97.2246 108.2331 119.0690
frequency: 97.2246 108.2173 119.0686 141.3244 274.4917 291.5818 302.8240 396.7755 405.1013 446.2564 480.4943 503.7633 507.8077 532.8773 673.8858 762.9008 923.0541 1032.7763 1046.6950 1088.3558 1091.5566 1170.8316 1392.2239 1408.3738 1457.5133 1463.9048 1466.0342 1475.8390 1631.7923 1657.1299 2984.5329 2986.8612 3062.1696 3062.7750 3102.1184 3109.6025
redmass: 4.3646 1.1511 1.0260 3.7501 4.4537 4.0273 2.6455 8.4733 13.0270 6.9583 11.9576 4.6296 12.7050 10.3469 5.2265 4.6195 2.0164 1.3558 1.4436 2.3236 1.8860 5.5993 1.2301 1.2099 1.0416 1.0419 1.0461 1.0821 8.9719 9.3421 1.0371 1.0376 1.0987 1.0988 1.0986 1.0956
irintensity: 0.1295 0.9655 0.0000 0.0000 0.9658 11.5880 0.1362 0.2140 13.6426 1.5149 4.2312 0.0000 1.4901 10.6645 28.6006 46.0683 1.7527 4.6400 0.0000 19.8571 20.0065 8.0509 6.1168 13.6555 0.0003 29.2111 8.4847 22.8092 200.4257 228.4254 25.1968 24.2468 0.0010 28.7783 10.1331 20.6853
temp: 298.150 k
press: 1.00000 atm
elementType: 16 16 8 6 6 6 6 6 1 1 1 1 1 1
symmnumber: 1
zpe: 255155.9 jmol-1
zpe.correction: 0.097184 hartree
zpe.thermalcorrener: 0.106336 hartree
zpe.thermalcorrenthalpy: 0.107280 hartree
zpe.thermalcorrgfe: 0.062717 hartree
zpe.sumelectzpe: -1064.869463 hartree
zpe.sumelectthermal: -1064.860310 hartree
zpe.sumelectthermalent: -1064.859366 hartree
zpe.sumelectthermalfe: -1064.903929 hartree
dipole: -5.2467 0.0000 -0.0004
dipole: 5.2467
quadrupole: -65.1001 -59.4019 -63.1495
quadrupole: 0.0000 -0.0013 0.0008
quadrupole: -2.5496 3.1486 -0.5990 0.0000 -0.0013 0.0008
hfenergy: -1064.9666466 hartree
pointgroup: C01 [X(C5H6O1S2)]
dipole: 2.0642021 0.0000671 0.0001781 debye
dipolederiv: -0.4493305 -0.1617201 -0.0018362 -0.3633575 -0.3922854 -0.0051248 -0.0041786 -0.0051232 0.0556774 -0.4493678 0.1617187 0.0017095 0.3633508 -0.3922491 -0.0050802 0.0041804 -0.0051822 0.0556769 -1.6048921 -0.0000437 -0.0000521 -0.0000426 -0.3329729 -0.0009878 0.0000039 -0.0010413 -0.244 0.3292732 -0.1582808 -0.0017586 -0.0881042 0.0442773 0.002264 -0.000878 0.0023581 -0.1572939 0.3292638 0.1582955 0.0020163 0.0881236 0.0442892 0.0023859 0.0010288 0.0026076 -0.1572892 -0.0742617 -0.0256375 -0.000289 -0.0081827 -0.0036744 -0.001212 -0.0000927 -0.0013223 0.1168597 -0.0742644 0.0256333 0.0002192 0.0081772 -0.0036727 -0.0012196 0.0000421 -0.0013664 0.1168588 1.8550172 0.0000329 0.0000084 0.000033 0.9413502 0.0097212 -0.0000932 0.0098855 0.0865861 0.0816627 -0.0159995 0.0284721 -0.0505579 0.0016177 -0.0968293 -0.0163221 -0.1166252 -0.0296969 0.0818688 -0.0146545 -0.0292463 -0.050615 -0.0036936 0.0975821 0.0147337 0.1172408 -0.0241604 -0.0942512 0.047594 0.0008211 0.1244139 0.0495459 -0.0011263 0.0016445 -0.0010207 0.1173188 0.0816683 0.0160456 -0.0284334 0.0505888 0.0016406 -0.0968058 0.016365 -0.1166154 -0.029708 0.0818541 0.0146192 0.0292709 0.0505948 -0.0037076 0.0976079 -0.0147071 0.1172466 -0.0241475 -0.0942404 -0.0476032 -0.0009018 -0.1244222 0.0495349 -0.0011754 -0.0017267 -0.0010419 0.117318 unknown
polarizability: 112.9440992|0.0002095|103.7457336|0.0101934|0.7038087|42.6839017 unknown
InChI: InChI=1S/C5H6OS2/c1-3-4(2)8-5(6)7-3/h1-2H3
charge 0 multiplicity 1
14 atoms
S  -0.710744 1.533845 0.017448
S  -0.71064 -1.533883 -0.017822
O  -2.998667 -0.000098 -0.000169
C  0.909505 0.683379 0.008106
C  0.909555 -0.683314 -0.007569
C  2.103474 1.608004 0.018719
C  2.103586 -1.607863 -0.017841
C  -1.76091 -0.000056 -0.000201
H  2.101868 2.24985 0.919169
H  2.099773 2.272806 -0.864909
H  3.047985 1.0413 0.010227
H  2.102344 -2.249662 -0.918325
H  2.099611 -2.272709 0.865751
H  3.048059 -1.041099 -0.008985
