program: Gaussian 09
title: 000142679
version: EM64L-G09RevD.01
frameworkgroup: C1[X(C11H14N2O)]
method: RPBEPBE
basis: SDD
operation: Freq
keyword: #p
keyword: freq=noraman
keyword: PBEPBE/SDD
title: #p freq=noraman PBEPBE/SDD
converged: YES YES NO NO
title: Mulliken charges:
elementType: O N N C C C C C C C C C C C H H H H H H H H H H H H H H
charge: -0.213905 -0.104515 -0.223661 0.100178 0.117650 0.185823 0.068537 -0.366342 -0.396364 -0.314940 -0.632032 -0.652024 -0.231663 -0.679327 0.233495 0.249018 0.232379 0.254650 0.254149 0.231237 0.297791 0.229415 0.229458 0.229155 0.228950 0.208918 0.232015 0.231953
chargesum: 0.00000
title: Mulliken charges with hydrogens summed into heavy atoms:
elementType: O N N C C C C C C C C C C C
charge: -0.213905 -0.104515 -0.223661 0.100178 0.117650 0.185823 0.068537 -0.132847 -0.147346 -0.082560 0.108004 0.104640 0.226441 -0.006441
polarizability: 1.87594915e+02 3.20154284e-01 1.97417131e+02 -8.89928180e-02 1.95595115e-02 7.26627524e+01
1716.lowfreq: -41.0637 0.0003 0.0005 0.0006 1.6870 4.8784 9.1145 46.7007 84.3943
frequency: -40.3374 46.7003 84.3858 95.2970 101.9473 121.7675 173.9708 179.4191 196.2790 239.5774 247.0187 294.5362 300.1296 303.0976 359.4129 404.5601 530.4605 572.1816 575.7626 579.7813 687.9730 699.8404 720.8265 733.9845 736.6037 799.1316 800.3276 833.3374 852.4540 885.0786 897.5892 973.2904 994.8482 1020.0606 1040.1088 1057.0841 1092.8634 1110.4792 1130.8385 1133.7834 1139.7221 1164.6339 1193.5503 1245.2546 1246.3155 1262.0951 1325.0137 1341.1111 1360.5000 1396.3272 1406.2619 1415.3336 1421.1330 1437.0313 1460.5758 1462.7705 1462.9762 1470.9725 1477.2141 1484.1791 1486.9470 1487.2925 1545.0759 1629.5596 2971.4457 2977.1356 2996.1571 3014.6251 3052.1980 3052.9461 3074.1524 3092.5936 3109.4496 3114.3753 3123.5367 3168.2201 3183.5807 3204.0453
redmass: 1.1470 2.6378 2.0270 2.7568 3.4617 2.6750 3.4977 1.2051 2.0214 4.3151 1.6897 3.9931 3.1785 4.3185 2.8978 4.2998 4.2955 2.7288 4.8191 7.6727 8.8804 9.7953 6.0721 1.2387 8.2128 1.0985 4.1720 1.4246 5.3665 1.3990 4.2254 3.0453 1.9543 2.3085 1.6163 1.4878 1.2232 2.3516 2.8347 1.4505 1.3688 2.3951 1.9838 1.1396 1.9914 4.3202 2.3125 2.8457 5.4791 1.4534 2.3167 1.8863 1.4107 1.4909 1.0400 1.3266 1.0912 1.1549 2.0133 1.0898 1.1573 1.0468 5.3486 6.8975 1.0347 1.0362 1.0358 1.0581 1.1018 1.1014 1.1063 1.0983 1.1029 1.0993 1.0987 1.0884 1.0952 1.1052
irintensity: 0.6062 1.2601 3.8111 5.4957 1.3155 1.2520 0.5223 0.4066 0.1091 0.0151 0.6214 1.8098 1.4526 2.9140 11.2907 11.7479 0.8008 11.5144 10.2732 0.6114 4.2623 8.7543 1.1540 98.1747 3.4875 4.0342 2.4922 1.1212 13.3266 0.5381 41.5047 13.3866 30.0587 111.9689 11.4199 38.6732 0.0456 6.7480 61.9473 4.9470 0.3012 33.9865 16.6976 0.0008 1.5941 41.6241 181.9590 103.6850 106.9628 179.6141 33.4037 122.1454 29.4383 89.3245 11.7093 42.8784 24.4160 11.8302 69.5496 2.3502 2.9775 11.0582 306.7864 573.4695 36.7018 91.0023 24.5514 17.3942 29.3907 21.6576 5.6243 27.8501 44.3598 16.5610 0.3164 4.2705 14.4196 27.1614
temp: 298.150 k
press: 1.00000 atm
elementType: 8 7 7 6 6 6 6 6 6 6 6 6 6 6 1 1 1 1 1 1 1 1 1 1 1 1 1 1
symmnumber: 1
zpe: 598510.2 jmol-1
zpe.correction: 0.227961 hartree
zpe.thermalcorrener: 0.241382 hartree
zpe.thermalcorrenthalpy: 0.242326 hartree
zpe.thermalcorrgfe: 0.187703 hartree
zpe.sumelectzpe: -611.204030 hartree
zpe.sumelectthermal: -611.190609 hartree
zpe.sumelectthermalent: -611.189664 hartree
zpe.sumelectthermalfe: -611.244287 hartree
dipole: -1.4230 -4.2566 0.0050
dipole: 4.4881
quadrupole: -63.3361 -77.8021 -86.6368
quadrupole: 4.1359 -0.0073 0.0002
quadrupole: 12.5889 -1.8771 -10.7118 4.1359 -0.0073 0.0002
hfenergy: -611.4319904 hartree
pointgroup: C01 [X(C11H14N2O1)]
dipole: 0.6340449 1.6478108 -0.0255078 debye
polarizability: 187.6356769|0.7443983|197.3461597|-0.9353895|-1.6873184|72.6929619 unknown
InChI: InChI=1S/C11H14N2O/c1-4-14-11-9-7-5-6-8(9)10(12-11)13(2)3/h5-7H,4H2,1-3H3
charge 0 multiplicity 1
28 atoms
O  -2.435074 -0.12598 0.006349
N  1.959247 1.648433 -0.054392
N  -0.384786 1.108924 -0.026971
C  1.121578 -0.724377 -0.015005
C  -0.221383 -1.244271 0.002929
C  0.976427 0.711353 -0.03318
C  -1.075631 -0.078411 -0.005479
C  2.027646 -1.837962 -0.006435
C  -0.161114 -2.664254 0.022273
C  1.231011 -3.023989 0.01628
C  3.365298 1.211769 -0.061626
C  1.654784 3.089827 -0.067496
C  -3.160603 1.184703 -0.004836
C  -4.648592 0.855298 0.018633
H  3.119717 -1.812845 -0.014579
H  -1.002877 -3.359087 0.038891
H  1.618888 -4.044673 0.027645
H  3.571562 0.578132 -0.944547
H  3.595895 0.622253 0.84569
H  4.022173 2.094635 -0.092402
H  0.561023 3.204356 -0.058364
H  2.071039 3.564157 -0.976116
H  2.088112 3.584061 0.822358
H  -2.834041 1.764045 0.877097
H  -2.856411 1.735985 -0.912446
H  -5.237754 1.790614 0.009167
H  -4.9333 0.255343 -0.862518
H  -4.912235 0.286661 0.926682
