program: Gaussian 09
title: 000142677
version: EM64L-G09RevD.01
frameworkgroup: C1[X(C14H21NO3)]
method: RPBEPBE
basis: SDD
operation: Freq
keyword: #p
keyword: freq=noraman
keyword: PBEPBE/SDD
title: #p freq=noraman PBEPBE/SDD
converged: YES YES NO NO
title: Mulliken charges:
elementType: O O O N C C C C C C C C C C C C C C H H H H H H H H H H H H H H H H H H H H H
charge: -0.247013 -0.221608 -0.220704 0.020918 -0.376075 -0.372395 -0.375390 -0.352251 -0.404636 -0.356699 -0.326528 -0.694824 0.364145 -0.309538 -0.343138 -0.361153 -0.334658 0.375676 0.197053 0.195129 0.191404 0.189602 0.192371 0.195159 0.189630 0.188523 0.218704 0.220203 0.195097 0.195542 0.217288 0.216169 0.210108 0.210214 0.216794 0.261280 0.263298 0.284445 0.287861
chargesum: 0.00000
title: Mulliken charges with hydrogens summed into heavy atoms:
elementType: O O O N C C C C C C C C C C C C C C
charge: -0.247013 -0.221608 -0.220704 0.020918 0.016107 0.008611 0.012140 0.025902 0.034271 0.033940 0.106929 -0.057709 0.364145 -0.048258 -0.079840 -0.076708 -0.046796 0.375676
polarizability: 2.91832469e+02 -6.75019111e+00 1.62113179e+02 2.72156039e+00 1.07887316e+00 1.02302994e+02
1716.lowfreq: -0.0007 0.0000 0.0010 3.6051 5.1411 12.1691 16.6354 28.5743 37.1969
frequency: 15.2174 28.4971 36.7097 45.1228 70.5377 82.7751 85.3190 92.3698 123.8231 136.4439 149.0172 152.1157 163.7768 165.9801 227.4856 230.1865 298.5075 300.6207 313.1220 400.5153 417.6082 420.2479 478.1940 493.6624 496.0717 522.9996 622.3383 631.4923 665.5636 721.9714 730.9413 734.0776 756.6572 757.4833 801.4184 813.1738 821.3985 852.9963 866.8229 888.7892 940.9454 953.3512 976.1879 988.4528 994.0887 995.1222 1011.4365 1023.1875 1047.4920 1077.2535 1080.2484 1088.2309 1097.1318 1110.7869 1126.5181 1146.3763 1168.6725 1187.8385 1221.7872 1224.8754 1227.0940 1237.4496 1262.7307 1266.6020 1281.5949 1287.0597 1292.5598 1294.4800 1299.0739 1307.1406 1340.0742 1352.6860 1355.8766 1359.2258 1378.8549 1388.7577 1403.3143 1437.6843 1461.9370 1462.4217 1467.4417 1468.0045 1472.8001 1476.3538 1478.2134 1482.9364 1487.4434 1490.2718 1587.0853 1612.7207 2951.2400 2953.4947 2955.0105 2958.2639 2963.8181 2969.1629 2972.2712 2986.3399 2994.3381 2996.5965 3006.0005 3017.5972 3024.1793 3039.4021 3066.2061 3068.7900 3071.9682 3164.5784 3167.5477 3184.2954 3189.0908
redmass: 4.5475 4.7711 2.1192 3.3213 5.3100 4.4217 3.4551 1.7520 3.4860 1.8930 2.4189 5.2549 2.6719 4.1209 1.2115 3.8765 6.6007 3.8496 4.9955 4.1671 4.4195 3.0270 3.4457 4.5413 3.0752 4.9335 7.0695 7.9864 4.5404 1.0622 1.0843 4.8359 1.3624 3.6126 1.1746 7.2763 1.2603 1.6261 1.2128 1.9022 1.1925 7.4687 1.3350 1.3325 3.2288 3.9247 1.1114 3.7155 3.1738 2.4619 2.2915 2.3174 3.0777 1.2540 2.9454 1.4069 1.4072 1.6760 1.2884 1.3953 5.2657 3.8997 1.2660 1.3021 1.0288 1.1290 1.2899 1.0995 1.1136 1.3263 1.4146 7.4830 1.6511 1.6092 1.5261 1.2172 6.5388 4.4451 1.0735 1.0782 1.1040 1.1398 1.1800 1.0504 1.2546 1.3044 1.1402 1.1503 7.8654 6.5164 1.0590 1.0583 1.0585 1.0567 1.0591 1.0588 1.0364 1.0970 1.0993 1.0592 1.1023 1.1059 1.1051 1.1049 1.1054 1.1008 1.0993 1.0885 1.0891 1.0961 1.0972
irintensity: 1.0660 0.7103 0.1127 0.1552 0.1635 0.6036 0.1446 0.1767 0.9731 1.8124 0.6585 0.6759 4.5424 1.1890 0.1555 1.5583 0.1335 1.2183 0.5898 0.7684 0.8778 0.0725 1.0919 2.8544 9.5268 1.3714 2.7801 34.3330 23.0409 14.4433 0.2760 5.2059 4.8166 1.9836 1.0149 19.9383 4.4262 72.5539 0.8013 2.5926 1.0102 121.4728 3.1870 0.2459 0.0466 5.7379 0.0987 10.1459 1.6850 2.1439 5.3555 27.0432 13.6903 24.2505 12.1306 1.3488 285.2524 0.0027 17.9635 0.2571 532.1215 189.9498 0.0103 5.1297 0.0546 0.8008 0.2700 0.1518 0.0043 0.7289 0.0587 88.5654 3.5329 1.1032 12.5760 11.7913 48.5489 12.6441 0.5000 0.4444 14.2209 13.0904 31.9389 13.5474 15.7809 22.1177 9.5126 19.3661 36.4757 239.0119 0.0497 1.1490 6.2278 13.7943 22.3439 154.3452 38.6461 0.2300 1.0048 35.9406 2.1248 15.8792 1.6181 96.8397 67.7489 116.7633 54.0894 6.0975 1.2782 2.6225 4.6816
temp: 298.150 k
press: 1.00000 atm
elementType: 8 8 8 7 6 6 6 6 6 6 6 6 6 6 6 6 6 6 1 1 1 1 1 1 1 1 1 1 1 1 1 1 1 1 1 1 1 1 1
symmnumber: 1
zpe: 858273.4 jmol-1
zpe.correction: 0.326899 hartree
zpe.thermalcorrener: 0.346405 hartree
zpe.thermalcorrenthalpy: 0.347350 hartree
zpe.thermalcorrgfe: 0.275591 hartree
zpe.sumelectzpe: -825.034968 hartree
zpe.sumelectthermal: -825.015462 hartree
zpe.sumelectthermalent: -825.014518 hartree
zpe.sumelectthermalfe: -825.086277 hartree
dipole: 7.8347 0.0270 0.1857
dipole: 7.8370
quadrupole: -166.6781 -107.7113 -109.1532
quadrupole: 7.8159 -0.7069 0.2738
quadrupole: -38.8306 20.1362 18.6944 7.8159 -0.7069 0.2738
hfenergy: -825.3618675 hartree
pointgroup: C01 [X(C14H21N1O3)]
dipole: 3.0763888 -0.0905686 -0.1853133 debye
polarizability: 291.2843368|2.1729254|155.1429265|-12.4263187|-19.0545212|109.821379 unknown
InChI: InChI=1S/C14H21NO3/c1-2-3-4-5-6-7-12-18-14-10-8-13(9-11-14)15(16)17/h8-11H,2-7,12H2,1H3
charge 0 multiplicity 1
39 atoms
O  -0.676332 0.886571 -0.286903
O  -6.508249 -1.414605 0.978929
O  -7.00421 0.698714 0.270569
N  -6.161876 -0.247157 0.538362
C  4.283443 0.327173 -0.285098
C  5.497482 -0.576773 0.025051
C  2.92566 -0.35751 -0.008136
C  6.853753 0.117911 -0.233175
C  1.724678 0.571437 -0.301796
C  8.071777 -0.777449 0.089357
C  0.388233 -0.105037 0.003634
C  9.421268 -0.070283 -0.161932
C  -1.999597 0.528992 -0.060874
C  -2.419176 -0.741989 0.421387
C  -2.959404 1.539624 -0.346882
C  -3.789067 -0.993184 0.616513
C  -4.323583 1.290026 -0.152553
C  -4.729165 0.020615 0.330228
H  4.323714 0.645545 -1.347469
H  4.353765 1.25457 0.320521
H  5.436328 -1.500555 -0.587665
H  5.450716 -0.903053 1.0853
H  2.894285 -0.684535 1.052332
H  2.848866 -1.27837 -0.623092
H  6.907003 0.438714 -1.294698
H  6.911956 1.04536 0.374372
H  1.804673 1.493029 0.305764
H  1.736843 0.882991 -1.363614
H  8.014831 -1.101838 1.14863
H  8.017487 -1.70164 -0.521708
H  0.234292 -1.000773 -0.632143
H  0.325475 -0.403777 1.070116
H  9.513177 0.839511 0.460974
H  9.51636 0.237805 -1.220359
H  10.275695 -0.730294 0.075705
H  -1.694167 -1.529345 0.642759
H  -2.604333 2.505464 -0.717032
H  -4.144026 -1.958887 0.986076
H  -5.080677 2.0495 -0.363352
