program: Gaussian 09
title: 000010404
version: EM64L-G09RevD.01
frameworkgroup: C1[X(C6H10O2S4)]
method: RPBEPBE
basis: SDD
operation: Freq
keyword: #p
keyword: freq=noraman
keyword: PBEPBE/SDD
title: #p freq=noraman PBEPBE/SDD
converged: YES YES NO NO
title: Mulliken charges:
elementType: S S S S O O C C C C C C H H H H H H H H H H
charge: 0.005009 0.193098 0.080343 0.153814 -0.137532 -0.111273 -0.244378 -0.235821 -0.664921 -0.672621 -0.371263 -0.365631 0.232372 0.245383 0.242706 0.260351 0.214403 0.241056 0.238093 0.219779 0.242217 0.234815
chargesum: 0.00000
title: Mulliken charges with hydrogens summed into heavy atoms:
elementType: S S S S O O C C C C C C
charge: 0.005009 0.193098 0.080343 0.153814 -0.137532 -0.111273 0.233378 0.267236 0.028632 0.024189 -0.371263 -0.365631
polarizability: 2.67136269e+02 -1.91169799e+01 1.25595997e+02 2.16589865e+01 4.44397279e+00 1.14305788e+02
1716.lowfreq: -6.8668 -0.0033 -0.0030 -0.0028 3.4444 6.1011 18.6977 26.1216 58.1949
frequency: 18.6509 26.0837 58.1618 71.0439 85.5072 101.4496 106.2104 120.3366 132.0237 139.5505 161.4160 208.3343 239.2324 241.5461 268.7014 333.6091 343.7007 352.0519 416.8762 429.0968 484.8971 508.4188 519.2982 558.0575 797.4729 800.4586 812.5757 822.4811 920.5075 939.7015 997.4449 1001.8845 1112.9348 1116.2827 1117.1764 1128.1186 1160.0257 1245.4170 1251.2938 1267.2523 1348.4837 1383.2700 1401.0273 1404.4755 1459.8923 1460.2070 1464.3128 1465.7371 1482.2193 1482.2978 2992.0283 2997.3108 3001.0154 3002.0262 3065.9638 3080.4668 3097.3393 3097.9361 3116.3845 3116.8603
redmass: 5.6675 8.1878 3.9365 2.4231 7.1136 3.1987 5.5360 4.3461 2.0942 7.7126 7.0440 6.7177 1.2064 1.2548 7.4753 8.4556 5.8107 5.9896 9.6295 10.2447 12.3649 11.6709 7.1527 7.1857 4.1261 4.6671 1.1142 1.0945 12.3957 11.3732 2.0694 2.0903 1.9691 2.1862 1.6554 1.4717 6.5709 3.6048 1.1667 1.1890 1.3423 1.4415 1.2387 1.3062 1.0428 1.0389 1.0776 1.0745 1.0586 1.0563 1.0609 1.0513 1.0365 1.0415 1.1078 1.1059 1.0982 1.0984 1.1025 1.1030
irintensity: 0.5166 1.4355 1.6337 0.5619 0.6831 3.2508 2.7333 2.2581 3.5982 0.3045 1.2695 2.8767 0.9240 0.9011 6.1632 15.3789 37.3147 16.2949 27.3529 5.7374 0.0912 2.4522 26.9312 4.4738 27.8029 23.7784 5.5392 6.3772 167.6780 303.5732 34.2257 63.1148 48.3784 13.9976 14.7633 15.7039 415.2252 426.9894 0.7376 21.1117 1.5270 35.4948 20.5967 7.9834 13.3395 14.3902 23.8071 3.0909 10.2200 11.7947 6.8238 24.2754 14.8836 14.9080 9.1884 6.3161 13.0887 20.2381 28.9377 19.7752
temp: 298.150 k
press: 1.00000 atm
elementType: 16 16 16 16 8 8 6 6 6 6 6 6 1 1 1 1 1 1 1 1 1 1
symmnumber: 1
zpe: 402750.0 jmol-1
zpe.correction: 0.153399 hartree
zpe.thermalcorrener: 0.169736 hartree
zpe.thermalcorrenthalpy: 0.170681 hartree
zpe.thermalcorrgfe: 0.106229 hartree
zpe.sumelectzpe: -1976.339435 hartree
zpe.sumelectthermal: -1976.323098 hartree
zpe.sumelectthermalent: -1976.322154 hartree
zpe.sumelectthermalfe: -1976.386606 hartree
dipole: -3.3991 2.0302 -3.7986
dipole: 5.4868
quadrupole: -94.0409 -97.3778 -105.2012
quadrupole: 8.9366 6.3438 -3.2186
quadrupole: 4.8324 1.4955 -6.3279 8.9366 6.3438 -3.2186
hfenergy: -1976.4928345 hartree
pointgroup: C01 [X(C6H10O2S4)]
dipole: 0.3952989 -1.2900722 -1.68504 debye
dipolederiv: -0.4303984 0.3623431 -0.0203752 0.5738882 -0.7629923 0.1019771 -0.1397148 0.3072381 -0.4462819 0.1316892 -0.4158805 -0.0102435 -0.4752791 0.5491506 0.1571066 -0.2063827 0.3222332 0.0401761 -0.3925157 0.0068426 0.2707042 0.1109603 -0.2430936 0.0522021 0.0588899 0.2904278 -0.6923415 -0.5933073 0.4222478 0.1618712 0.1520871 -0.6124211 -0.2091842 0.172077 -0.2895193 -0.1552661 -1.4435139 0.7397759 0.6486322 0.9271783 -0.8185495 -0.3498831 0.3850653 -0.1015649 -0.5889633 -0.9657033 -0.593542 -0.1282863 -0.8572731 -1.1788813 -0.2770367 -0.1356278 -0.2179464 -0.2217517 0.7278906 -0.2162276 -0.2093361 -0.0465284 0.3145597 0.1202298 -0.4650408 0.3160853 0.535947 0.1909926 0.1117067 -0.0255299 0.4399834 0.7732815 0.1328574 0.111356 0.1519517 0.3043517 -0.0867036 0.1016063 0.0222235 0.0907646 -0.0089543 -0.0133635 0.0214338 -0.0057071 0.0361734 -0.0300748 -0.0908964 0.0114455 -0.1147059 -0.0689567 -0.0128643 -0.0118659 -0.0177467 0.0610355 1.1077389 -0.6655971 -0.6614199 -1.1738683 0.9591115 -0.0275706 0.2261667 -0.9560436 1.0667689 1.4993133 0.2599744 -0.1100479 0.5622512 1.0016981 0.3577245 -0.1244206 0.3022536 0.1125834 -0.1045898 0.0114474 -0.0800018 -0.0723968 0.1128079 0.0004991 0.0034451 -0.0397517 -0.0779587 0.0604157 -0.0297532 0.0278931 -0.0336635 -0.105099 0.013743 0.1068847 -0.0637581 -0.0027723 0.0639567 0.0032631 0.0989207 -0.0883896 -0.0441395 0.0330918 0.0376068 -0.0089937 -0.0433851 0.1022649 0.0294813 0.0015348 -0.0849309 -0.0210124 -0.0308837 -0.0055301 -0.0350702 0.0063821 0.0025819 0.0374132 0.110192 0.0234634 0.0933592 0.0137081 0.1382037 -0.0099784 -0.0733686 0.0281689 -0.0162662 -0.0825665 -0.0125724 0.0579868 -0.0637772 -0.1494812 -0.0175584 -0.007946 0.0580384 -0.0875144 0.0093428 -0.0298177 -0.1021185 0.0125596 -0.0334527 0.0588196 0.1176032 0.0636589 0.0444582 0.0259522 -0.0010175 -0.0843853 -0.0699489 0.0170147 -0.0728338 0.0858132 0.062912 -0.0288922 0.0222918 0.0174104 0.1133239 -0.0045513 0.0737422 0.0339344 -0.0907215 -0.0528152 0.0140098 -0.0831969 0.0924565 0.0753244 0.0633643 -0.0803692 0.0535286 0.0339222 unknown
polarizability: 193.0400677|-68.1238681|188.2550878|-37.6614977|25.2623322|125.7428985 unknown
InChI: InChI=1S/C6H10O2S4/c1-3-7-5(9)11-12-6(10)8-4-2/h3-4H2,1-2H3
charge 0 multiplicity 1
22 atoms
S  0.38779 0.308577 -1.012613
S  -0.622491 2.18823 0.079111
S  0.133728 -0.879847 1.899004
S  -2.809146 3.668363 1.148194
O  1.936641 -1.638573 0.10637
O  -3.28324 1.160353 0.333676
C  2.705381 -1.55507 -1.187878
C  -2.911645 -0.215918 -0.179441
C  3.859709 -2.540415 -1.051352
C  -4.166993 -1.065284 -0.047999
C  0.880929 -0.806952 0.395263
C  -2.402126 2.15636 0.495358
H  2.021973 -1.824034 -2.015037
H  3.049577 -0.513143 -1.320026
H  -2.58126 -0.096912 -1.225481
H  -2.078526 -0.584327 0.448048
H  4.466136 -2.529887 -1.975277
H  4.509659 -2.266285 -0.203868
H  3.486662 -3.565542 -0.890331
H  -3.95138 -2.084775 -0.41628
H  -4.485286 -1.138851 1.005032
H  -4.997794 -0.649069 -0.642172
