program: Gaussian 09
title: 000142663
version: EM64L-G09RevD.01
frameworkgroup: C1[X(C7H9N)]
method: RPBEPBE
basis: SDD
operation: Freq
keyword: #p
keyword: freq=noraman
keyword: PBEPBE/SDD
title: #p freq=noraman PBEPBE/SDD
converged: YES YES NO NO
title: Mulliken charges:
elementType: N C C C C C C C H H H H H H H H H
charge: -0.596520 0.431356 -0.499475 -0.372281 -0.425730 -0.218465 -0.219203 -0.244558 0.224781 0.197060 0.277639 0.227433 0.222274 0.222265 0.224965 0.271546 0.276912
chargesum: 0.00000
title: Mulliken charges with hydrogens summed into heavy atoms:
elementType: N C C C C C C C
charge: -0.048062 0.431356 -0.077634 -0.094642 -0.198296 0.003809 0.003061 -0.019593
polarizability: 1.03306087e+02 -4.18423414e-01 8.48015666e+01 -4.32665467e+00 -7.05112983e-01 4.15362680e+01
1716.lowfreq: -6.6270 0.0003 0.0004 0.0005 7.7607 16.7817 65.9477 165.5499 243.7250
frequency: 65.9398 165.5496 243.7200 267.1070 407.9019 411.1269 465.4812 547.1544 609.4908 617.8904 705.9188 741.1572 780.9920 860.2683 909.1838 951.9308 982.4929 989.1677 1000.1296 1022.8189 1059.5068 1090.4580 1133.3432 1167.9752 1177.5721 1213.5162 1261.6658 1316.7346 1365.2865 1391.0684 1440.0080 1472.4253 1484.6071 1594.6234 1613.0951 1641.8820 2878.4216 2987.4053 3109.2455 3121.6256 3135.2359 3150.2310 3161.4497 3479.9477 3611.2752
redmass: 2.6458 2.5959 2.7206 1.2800 2.8343 3.2785 3.1293 1.9187 2.2779 4.0215 2.2138 1.5644 3.1524 1.2494 1.3573 1.4870 1.3660 6.1119 1.3113 2.2891 2.0994 1.9383 1.4224 1.0669 1.1089 2.4618 1.2279 1.2879 1.8842 3.5236 2.1356 1.3593 1.6270 6.1437 5.5177 1.1166 1.0711 1.0874 1.0869 1.0864 1.0921 1.0950 1.1006 1.0449 1.0988
irintensity: 1.2844 9.2322 9.1314 46.5832 2.0092 8.1273 8.1017 104.1067 93.7589 32.6019 33.0775 64.7793 18.2850 0.0773 2.5969 7.0023 0.0608 0.0543 1.4945 11.0005 13.5767 6.0441 4.2210 0.5237 1.1263 6.3053 7.2769 4.7666 10.3530 7.0261 14.8800 18.8180 2.5821 0.1470 3.5740 49.1057 95.4554 30.4751 10.6784 1.2013 31.2209 25.4705 22.0729 0.4926 1.2698
temp: 298.150 k
press: 1.00000 atm
elementType: 7 6 6 6 6 6 6 6 1 1 1 1 1 1 1 1 1
symmnumber: 1
zpe: 375651.5 jmol-1
zpe.correction: 0.143078 hartree
zpe.thermalcorrener: 0.150431 hartree
zpe.thermalcorrenthalpy: 0.151375 hartree
zpe.thermalcorrgfe: 0.111341 hartree
zpe.sumelectzpe: -326.294242 hartree
zpe.sumelectthermal: -326.286889 hartree
zpe.sumelectthermalent: -326.285945 hartree
zpe.sumelectthermalfe: -326.325979 hartree
dipole: -1.2187 0.7945 -0.4717
dipole: 1.5293
quadrupole: -38.2835 -45.3136 -50.1194
quadrupole: -1.6196 0.5384 0.4172
quadrupole: 6.2887 -0.7414 -5.5472 -1.6196 0.5384 0.4172
hfenergy: -326.43732 hartree
pointgroup: C01 [X(C7H9N1)]
dipole: 0.5105844 -0.3107674 -0.0689639 debye
dipolederiv: -0.5633508 0.0236332 0.1385372 0.0118972 -0.7292696 0.0739111 0.177282 0.102954 -0.3067325 0.1854147 -0.019588 0.0883968 0.0230494 -0.0761597 0.0307816 0.1640417 0.0254006 -0.0233738 0.4251992 0.1168613 -0.1638775 0.0407567 0.4698797 -0.0573306 -0.2796108 -0.114017 0.2887853 -0.1609474 0.0841453 -0.0215115 0.0973898 -0.0087434 -0.023065 -0.0629384 -0.0358667 -0.1567463 -0.1404465 -0.0429158 0.0176014 -0.0730432 0.0477455 -0.0805062 0.0286944 -0.0847848 -0.1591515 0.0139514 -0.0567456 0.035417 -0.0558324 0.0903002 -0.0788354 0.0406634 -0.079087 -0.131801 0.0116807 0.0664229 0.0059059 0.0916486 0.0629096 -0.0452254 -0.0110573 -0.048248 -0.142337 0.0579766 -0.0063287 0.0306825 -0.0287849 -0.0925585 -0.0265528 0.0336429 -0.0253693 -0.1672822 -0.0483507 -0.0130523 -0.062351 -0.0759463 0.0552286 -0.0610617 -0.050071 -0.0260342 -0.1336442 -0.0313301 -0.0061606 0.0332357 0.0466767 -0.2962439 0.0660929 0.04458 0.0264041 0.0408262 0.1006987 -0.081833 0.0087177 -0.0806457 0.005426 0.0322185 -0.0007757 0.0380928 0.143819 0.0443309 0.100113 -0.0369282 0.0742419 -0.0677774 0.0686856 -0.0279048 0.0679796 0.1307015 0.0356197 0.0750949 -0.0323482 0.0890699 -0.0805996 0.0761241 -0.0316445 0.0775833 0.1291204 -0.0057726 -0.1067439 0.0132701 -0.11621 -0.0531437 0.0449528 0.0129069 0.043961 0.1477196 -0.1421715 0.015023 -0.0384814 0.0139741 0.0914295 0.0222752 -0.0436878 0.0229848 0.1525153 0.243284 -0.0679341 0.0192374 -0.0878647 0.2381717 -0.0887743 0.0271919 -0.0346071 0.0310793 -0.0257863 -0.0799916 -0.035504 0.029623 0.343405 0.0463096 -0.0213129 0.0426539 0.1565018 unknown
polarizability: 102.8918475|3.1794126|80.7726662|5.5311809|-12.669495|45.9794081 unknown
InChI: InChI=1S/C7H9N/c8-6-7-4-2-1-3-5-7/h1-5H,6,8H2
charge 0 multiplicity 1
17 atoms
N  2.863323 0.566443 -0.410414
C  0.573526 -0.20042 0.216183
C  2.077982 -0.31999 0.465006
C  0.00243 1.027867 -0.200514
C  -0.276965 -1.314932 0.42607
C  -1.392761 1.142012 -0.392653
C  -1.674028 -1.202328 0.239329
C  -2.237272 0.028424 -0.17085
H  2.29072 -0.015949 1.510385
H  2.359499 -1.398777 0.394847
H  0.674595 1.874645 -0.375643
H  0.155456 -2.275619 0.735198
H  -1.822268 2.097959 -0.714884
H  -2.319379 -2.07274 0.405503
H  -3.319405 0.116745 -0.321027
H  2.797761 0.347972 -1.407994
H  3.821386 0.745388 -0.103041
